program: Orca
programVersion: 5.0.2
elementType: O O O C C C C C C C C C C C C C C C C C C C C C C H H H H H H H H H H H H H H H H H H H H H H H H H H
charge: 0
multiplicity: 1
keywords: wb97x-d3
keywords: def2-TZVPP
keywords: def2/J RIJCOSX
keywords: DEFGRID2
keywords: scfconv7
keywords: smallprint printgap noloewdin
keywords: NOSOSCF
formula: C22H26O3
InChI: InChI=1/C22H26O3/c1-15(2)10-19-20(22(19,3)4)21(23)25-14-17-12-18(24-13-17)11-16-8-6-5-7-9-16/h5-10,12-13,19-20H,11,14H2,1-4H3
51 atoms
O  2.139795 2.07832 -0.299944
O  2.203987 0.673131 1.43685
O  -1.81323 0.774006 -1.532233
C  4.922701 -0.311892 0.325545
C  3.904799 -1.037505 -0.481194
C  3.817014 0.491006 -0.328877
C  4.999044 -0.48672 1.822363
C  6.283242 -0.118048 -0.30405
C  2.887368 -1.936992 0.112526
C  2.667207 1.06064 0.387504
C  1.715734 -2.20734 -0.469431
C  0.724001 -3.138043 0.155522
C  1.30898 -1.569124 -1.768185
C  0.874472 2.60697 0.136162
C  -0.246812 1.715891 -0.269435
C  -0.828372 0.618061 0.445908
C  -0.886258 1.753739 -1.462661
C  -1.771493 0.082825 -0.363582
C  -2.751747 -1.019737 -0.183214
C  -4.120808 -0.490823 0.171993
C  -5.008602 -0.080222 -0.818625
C  -4.496952 -0.362737 1.506223
C  -6.245786 0.452576 -0.481651
C  -5.733919 0.167501 1.845963
C  -6.611524 0.580099 0.852003
H  4.217162 -1.315597 -1.485176
H  4.10707 1.053052 -1.208749
H  4.050075 -0.721414 2.294458
H  5.68941 -1.299562 2.05442
H  5.390158 0.416727 2.29323
H  6.918673 -0.984659 -0.112739
H  6.217627 0.01403 -1.384556
H  6.783719 0.759018 0.110295
H  3.123279 -2.408674 1.061518
H  0.492774 -3.972794 -0.510876
H  -0.223101 -2.625289 0.34477
H  1.081053 -3.546985 1.10045
H  2.091229 -1.645729 -2.525987
H  1.100784 -0.502998 -1.642993
H  0.408266 -2.028037 -2.175811
H  0.795987 3.570383 -0.363268
H  0.879844 2.785794 1.211197
H  -0.583572 0.279405 1.439735
H  -0.787996 2.397172 -2.323433
H  -2.385763 -1.667016 0.61453
H  -2.802403 -1.627328 -1.090017
H  -4.734246 -0.181335 -1.862016
H  -3.815329 -0.682216 2.285857
H  -6.925764 0.767775 -1.262539
H  -6.012394 0.257714 2.888085
H  -7.57575 0.995371 1.114814
elementType: O C H
totalener: -1079.73614884 hartree
nucrepener: 2174.77767790 hartree
electener: -3254.51382674 hartree
oneelecener: -5789.32053865 hartree
twoeener: 2534.80671191 hartree
cpcmener: -0.03100541 hartree
kineticenergy: 1074.85795556 hartree
xcener: -106.463100907442 hartree
chargesum: -0.0000000
charge: -0.294971 -0.494810 -0.287450 0.128679 -0.017182 -0.099534 -0.297843 -0.264958 -0.275742 0.403879 -0.019814 -0.208813 -0.282054 0.072344 -0.071808 -0.327615 -0.034164 0.221828 -0.049936 0.046789 -0.212956 -0.203924 -0.160372 -0.156215 -0.175725 0.114251 0.093136 0.091902 0.098815 0.102395 0.094464 0.087679 0.095900 0.127206 0.101504 0.076931 0.091395 0.115299 0.086927 0.104191 0.122099 0.118430 0.157741 0.175629 0.115175 0.122772 0.142501 0.144150 0.160211 0.160336 0.161329
qa: -0.2950 -0.4948 -0.2875 0.1287 -0.0172 -0.0995 -0.2978 -0.2650 -0.2757 0.4039 -0.0198 -0.2088 -0.2821 0.0723 -0.0718 -0.3276 -0.0342 0.2218 -0.0499 0.0468 -0.2130 -0.2039 -0.1604 -0.1562 -0.1757 0.1143 0.0931 0.0919 0.0988 0.1024 0.0945 0.0877 0.0959 0.1272 0.1015 0.0769 0.0914 0.1153 0.0869 0.1042 0.1221 0.1184 0.1577 0.1756 0.1152 0.1228 0.1425 0.1442 0.1602 0.1603 0.1613
va: 2.0995 1.9882 2.2588 3.7684 3.8003 3.8380 3.8885 3.8977 3.8077 4.0838 3.6675 3.9133 3.9526 3.8539 3.6046 3.9469 3.9479 3.5595 3.7718 3.5962 3.9615 3.9325 3.8986 3.8920 3.8931 1.0064 1.0329 1.0179 0.9988 1.0000 1.0023 1.0046 1.0022 0.9998 0.9958 0.9987 1.0103 1.0016 1.0001 1.0059 0.9960 1.0077 1.0211 0.9945 1.0065 1.0068 1.0104 1.0030 0.9901 0.9902 0.9894
dispcorr: -0.027291220 hartree
energy: -1079.763440060403
dipole: 16.24658 -16.05660 0.18998 -11.52896 11.53003 0.00107 0.47906 -1.35639 -0.87733
magnitude: 0.89767 au
magnitude: 2.28169 debye
