program: Orca
programVersion: 5.0.2
elementType: O O O C C C C C C C C C C C C C C C C C C C C C C H H H H H H H H H H H H H H H H H H H H H H H H H H
charge: 0
multiplicity: 1
keywords: wb97x-d3
keywords: def2-TZVPP
keywords: def2/J RIJCOSX
keywords: DEFGRID2
keywords: scfconv7
keywords: smallprint printgap noloewdin
keywords: NOSOSCF
formula: C22H26O3
InChI: InChI=1/C22H26O3/c1-15(2)10-19-20(22(19,3)4)21(23)25-14-17-12-18(24-13-17)11-16-8-6-5-7-9-16/h5-10,12-13,19-20H,11,14H2,1-4H3
51 atoms
O  2.314632 1.370947 0.231306
O  2.080652 1.55844 -1.980507
O  -1.876271 1.983787 1.426884
C  4.11529 -1.029289 -0.227771
C  2.729695 -1.570669 -0.198778
C  3.070931 -0.40091 -1.133927
C  4.695059 -0.303583 0.96133
C  5.155949 -1.842942 -0.963501
C  1.828731 -1.430812 0.969548
C  2.451839 0.928838 -1.009366
C  0.500585 -1.551507 0.897856
C  -0.363083 -1.452644 2.115923
C  -0.211172 -1.759622 -0.408282
C  1.595231 2.594823 0.465911
C  0.131708 2.346887 0.551435
C  -0.814513 2.155113 -0.509675
C  -0.576282 2.226734 1.698786
C  -2.014577 1.93546 0.076687
C  -3.362751 1.616869 -0.464336
C  -3.63035 0.129437 -0.490224
C  -3.573729 -0.57418 -1.689419
C  -3.911623 -0.567676 0.682979
C  -3.796439 -1.944975 -1.719915
C  -4.126807 -1.938799 0.656786
C  -4.0704 -2.63239 -0.545841
H  2.580114 -2.487626 -0.764244
H  3.160919 -0.678332 -2.17765
H  3.961866 0.195568 1.587387
H  5.224376 -1.019926 1.592559
H  5.422256 0.443123 0.637931
H  5.59714 -2.588153 -0.298827
H  4.731389 -2.370603 -1.818269
H  5.962884 -1.206153 -1.331087
H  2.285318 -1.253355 1.938423
H  -1.103354 -0.655765 2.010867
H  0.21657 -1.259549 3.018505
H  -0.930952 -2.374707 2.266955
H  0.282481 -2.50497 -1.03462
H  -0.247356 -0.833991 -0.990193
H  -1.240002 -2.085771 -0.255831
H  1.840576 3.335765 -0.294466
H  1.971655 2.957321 1.420747
H  -0.626454 2.180845 -1.570895
H  -0.298487 2.303138 2.738624
H  -3.426674 2.017212 -1.476554
H  -4.127714 2.126122 0.127278
H  -3.358473 -0.044213 -2.609772
H  -3.968758 -0.036386 1.625623
H  -3.754894 -2.475502 -2.662526
H  -4.343804 -2.465716 1.57715
H  -4.241278 -3.700837 -0.566941
elementType: O C H
totalener: -1079.73501852 hartree
nucrepener: 2260.34911400 hartree
electener: -3340.08413253 hartree
oneelecener: -5960.35784458 hartree
twoeener: 2620.27371206 hartree
cpcmener: -0.03026562 hartree
kineticenergy: 1074.85618479 hartree
xcener: -106.465689978517 hartree
chargesum: 0.0000000
charge: -0.264121 -0.516837 -0.283206 0.137523 -0.034440 -0.129044 -0.288305 -0.268822 -0.238076 0.433799 -0.013350 -0.259092 -0.275707 0.053760 -0.017811 -0.366684 -0.061167 0.238894 -0.046670 0.068136 -0.206711 -0.239192 -0.151256 -0.153872 -0.156460 0.114362 0.090377 0.089084 0.098241 0.102821 0.094283 0.087896 0.096373 0.128489 0.086284 0.103432 0.110510 0.114235 0.095249 0.071669 0.123586 0.112641 0.158709 0.177814 0.104358 0.117376 0.141258 0.143978 0.157708 0.159465 0.158517
qa: -0.2641 -0.5168 -0.2832 0.1375 -0.0344 -0.1290 -0.2883 -0.2688 -0.2381 0.4338 -0.0134 -0.2591 -0.2757 0.0538 -0.0178 -0.3667 -0.0612 0.2389 -0.0467 0.0681 -0.2067 -0.2392 -0.1513 -0.1539 -0.1565 0.1144 0.0904 0.0891 0.0982 0.1028 0.0943 0.0879 0.0964 0.1285 0.0863 0.1034 0.1105 0.1142 0.0952 0.0717 0.1236 0.1126 0.1587 0.1778 0.1044 0.1174 0.1413 0.1440 0.1577 0.1595 0.1585
va: 2.1118 1.9758 2.2561 3.7560 3.7886 3.8733 3.8959 3.9003 3.7872 4.0827 3.6648 3.9132 3.9568 3.8481 3.5527 3.9636 3.9278 3.5875 3.7960 3.5508 3.9088 3.9016 3.8582 3.8523 3.8516 1.0047 1.0315 1.0129 0.9989 1.0005 1.0022 1.0055 1.0019 0.9994 0.9939 1.0118 0.9954 1.0078 1.0013 1.0170 1.0068 1.0017 1.0218 0.9937 1.0125 1.0087 1.0044 1.0132 0.9908 0.9911 0.9901
dispcorr: -0.030800256 hartree
energy: -1079.765818779747
dipole: 10.76158 -10.76163 -0.00005 -13.74273 13.21766 -0.52508 2.94175 -1.97827 0.96348
magnitude: 1.09727 au
magnitude: 2.78903 debye
