program: Orca
programVersion: 5.0.2
elementType: O O O C C C C C C C C C C C C C C C C C C C C C C H H H H H H H H H H H H H H H H H H H H H H H H H H
charge: 0
multiplicity: 1
keywords: wb97x-d3
keywords: def2-TZVPP
keywords: def2/J RIJCOSX
keywords: DEFGRID2
keywords: scfconv7
keywords: smallprint printgap noloewdin
keywords: NOSOSCF
formula: C22H26O3
InChI: InChI=1/C22H26O3/c1-15(2)10-19-20(22(19,3)4)21(23)25-14-17-12-18(24-13-17)11-16-8-6-5-7-9-16/h5-10,12-13,19-20H,11,14H2,1-4H3
51 atoms
O  2.067213 1.457577 0.213328
O  4.145008 2.231362 -0.013787
O  -2.007172 2.233971 -0.73185
C  3.153811 -1.300766 0.540184
C  2.92523 -1.112202 -0.923911
C  3.776495 -0.101983 -0.159191
C  2.042815 -1.149852 1.553275
C  4.150575 -2.364691 0.940303
C  1.625221 -0.72652 -1.535021
C  3.364605 1.301425 0.02584
C  0.506819 -1.454628 -1.510087
C  -0.750766 -0.959971 -2.158375
C  0.393152 -2.791888 -0.84746
C  1.484997 2.771001 0.20313
C  0.02071 2.545274 0.113945
C  -0.848701 2.072586 1.149072
C  -0.740016 2.62027 -1.001971
C  -2.065691 1.899673 0.5833
C  -3.348315 1.354601 1.098599
C  -3.494615 -0.110792 0.76042
C  -4.283095 -0.52943 -0.305502
C  -2.79709 -1.065342 1.496962
C  -4.37419 -1.878265 -0.629973
C  -2.888269 -2.411659 1.177663
C  -3.675993 -2.822341 0.108723
H  3.536802 -1.74934 -1.559274
H  4.844762 -0.175013 -0.325643
H  2.401423 -0.641195 2.450025
H  1.172555 -0.614944 1.184627
H  1.704864 -2.140908 1.859814
H  4.580015 -2.14917 1.920532
H  3.661497 -3.339116 1.001237
H  4.971727 -2.448553 0.227513
H  1.606505 0.209676 -2.085582
H  -1.12066 -1.670216 -2.902196
H  -0.60952 0.002397 -2.649833
H  -1.548584 -0.848581 -1.418172
H  -0.350446 -2.76887 -0.047001
H  1.332712 -3.14748 -0.429222
H  0.043427 -3.538375 -1.565369
H  1.847257 3.340418 -0.654345
H  1.760103 3.304647 1.114398
H  -0.591678 1.882057 2.179363
H  -0.525469 2.924955 -2.014392
H  -4.190462 1.920729 0.695002
H  -3.361477 1.48818 2.181187
H  -4.83288 0.201861 -0.885882
H  -2.176579 -0.750125 2.328056
H  -4.991776 -2.190012 -1.46239
H  -2.344293 -3.141685 1.763153
H  -3.74799 -3.87259 -0.142049
elementType: O C H
totalener: -1079.73413183 hartree
nucrepener: 2264.13541214 hartree
electener: -3343.86954398 hartree
oneelecener: -5967.23407340 hartree
twoeener: 2623.36452943 hartree
cpcmener: -0.03289267 hartree
kineticenergy: 1074.87251763 hartree
xcener: -106.467951478333 hartree
chargesum: -0.0000000
charge: -0.251865 -0.513831 -0.280401 0.075672 0.010472 -0.093669 -0.257071 -0.276024 -0.270359 0.408042 0.000112 -0.206004 -0.288992 0.079283 -0.071249 -0.339950 -0.053269 0.210711 -0.053899 0.045157 -0.179521 -0.191635 -0.157628 -0.182926 -0.166170 0.112284 0.092357 0.116370 0.066870 0.095805 0.099151 0.091685 0.088434 0.116846 0.114555 0.097948 0.027184 0.100512 0.101286 0.111456 0.111249 0.120796 0.164211 0.180536 0.110622 0.116975 0.140721 0.144143 0.158727 0.163688 0.160605
qa: -0.2519 -0.5138 -0.2804 0.0757 0.0105 -0.0937 -0.2571 -0.2760 -0.2704 0.4080 0.0001 -0.2060 -0.2890 0.0793 -0.0712 -0.3399 -0.0533 0.2107 -0.0539 0.0452 -0.1795 -0.1916 -0.1576 -0.1829 -0.1662 0.1123 0.0924 0.1164 0.0669 0.0958 0.0992 0.0917 0.0884 0.1168 0.1146 0.0979 0.0272 0.1005 0.1013 0.1115 0.1112 0.1208 0.1642 0.1805 0.1106 0.1170 0.1407 0.1441 0.1587 0.1637 0.1606
va: 2.1021 1.9857 2.2520 3.7081 3.7848 3.8800 3.8760 3.9158 3.8558 4.1160 3.6062 3.9146 3.9435 3.8563 3.7031 3.9666 3.9099 3.5967 3.8108 3.5653 3.8961 3.8692 3.8738 3.8680 3.8542 1.0054 1.0265 1.0033 1.0078 0.9998 1.0003 1.0031 1.0054 1.0119 1.0006 1.0096 1.0167 0.9974 1.0075 1.0004 1.0047 0.9921 1.0060 0.9935 1.0130 1.0076 1.0046 1.0029 0.9902 0.9893 0.9899
dispcorr: -0.031019148 hartree
energy: -1079.765150981673
dipole: 2.91226 -4.28954 -1.37728 -18.59525 17.44268 -1.15257 0.67816 -0.30808 0.37008
magnitude: 1.83366 au
magnitude: 4.66079 debye
