program: Orca
programVersion: 5.0.2
elementType: O O O C C C C C C C C C C C C C C C C C C C C C C H H H H H H H H H H H H H H H H H H H H H H H H H H
charge: 0
multiplicity: 1
keywords: wb97x-d3
keywords: def2-TZVPP
keywords: def2/J RIJCOSX
keywords: DEFGRID2
keywords: scfconv7
keywords: smallprint printgap noloewdin
keywords: NOSOSCF
formula: C22H26O3
InChI: InChI=1/C22H26O3/c1-15(2)10-19-20(22(19,3)4)21(23)25-14-17-12-18(24-13-17)11-16-8-6-5-7-9-16/h5-10,12-13,19-20H,11,14H2,1-4H3
51 atoms
O  2.420101 2.162672 -0.174466
O  1.589759 0.809711 1.396082
O  -1.648064 1.739971 -1.341496
C  3.773091 -1.233772 0.631985
C  2.889134 -1.284324 -0.569513
C  3.380561 0.068874 -0.02387
C  3.264875 -1.641463 1.994144
C  5.21993 -1.620642 0.424127
C  1.46169 -1.677437 -0.508925
C  2.381049 1.011021 0.503174
C  0.596018 -1.521717 -1.515764
C  -0.81258 -2.018993 -1.416093
C  0.958316 -0.874756 -2.8183
C  1.411048 3.140212 0.118122
C  0.045801 2.655647 -0.234875
C  -1.084741 2.558034 0.635774
C  -0.359398 2.14917 -1.422338
C  -2.083969 1.994207 -0.08095
C  -3.450679 1.545946 0.283906
C  -3.518438 0.054783 0.528969
C  -2.749443 -0.52666 1.53589
C  -4.344523 -0.760135 -0.236269
C  -2.814044 -1.889974 1.778618
C  -4.407719 -2.129019 0.000854
C  -3.645115 -2.69736 1.010323
H  3.387989 -1.543211 -1.49873
H  4.146577 0.539147 -0.629696
H  3.783042 -1.087056 2.778249
H  2.198717 -1.499659 2.1401
H  3.477501 -2.700691 2.150206
H  5.859859 -1.154008 1.175473
H  5.341754 -2.701984 0.509411
H  5.586614 -1.321263 -0.558436
H  1.11172 -2.164462 0.395726
H  -1.047341 -2.694088 -2.243389
H  -1.524399 -1.192269 -1.482683
H  -0.994982 -2.551436 -0.483507
H  1.840582 -0.239795 -2.74938
H  0.13391 -0.264793 -3.191705
H  1.151905 -1.631284 -3.58446
H  1.69883 4.005939 -0.476506
H  1.45314 3.432528 1.168703
H  -1.134404 2.858889 1.670603
H  0.132421 2.018964 -2.373379
H  -4.165997 1.825996 -0.492658
H  -3.744709 2.080704 1.189253
H  -2.094467 0.093075 2.137572
H  -4.946365 -0.322772 -1.023978
H  -2.212303 -2.32487 2.566367
H  -5.057523 -2.749199 -0.603156
H  -3.694918 -3.762003 1.198315
elementType: O C H
totalener: -1079.73528147 hartree
nucrepener: 2260.68304449 hartree
electener: -3340.41832596 hartree
oneelecener: -5961.99628033 hartree
twoeener: 2621.57795437 hartree
cpcmener: -0.03276991 hartree
kineticenergy: 1074.86344869 hartree
xcener: -106.466665292460 hartree
chargesum: 0.0000000
charge: -0.289064 -0.490608 -0.283160 0.151405 -0.030432 -0.106672 -0.294775 -0.265701 -0.262221 0.392254 -0.014505 -0.246897 -0.306635 0.094634 -0.031490 -0.336171 -0.073581 0.210118 -0.045589 0.001913 -0.167458 -0.184535 -0.178670 -0.149944 -0.169797 0.113101 0.094958 0.103718 0.085766 0.098053 0.095956 0.094853 0.087475 0.131294 0.112225 0.080788 0.097922 0.099910 0.094448 0.121345 0.122008 0.121082 0.164816 0.176794 0.105201 0.115725 0.143024 0.141462 0.158744 0.157514 0.159397
qa: -0.2891 -0.4906 -0.2832 0.1514 -0.0304 -0.1067 -0.2948 -0.2657 -0.2622 0.3923 -0.0145 -0.2469 -0.3066 0.0946 -0.0315 -0.3362 -0.0736 0.2101 -0.0456 0.0019 -0.1675 -0.1845 -0.1787 -0.1499 -0.1698 0.1131 0.0950 0.1037 0.0858 0.0981 0.0960 0.0949 0.0875 0.1313 0.1122 0.0808 0.0979 0.0999 0.0944 0.1213 0.1220 0.1211 0.1648 0.1768 0.1052 0.1157 0.1430 0.1415 0.1587 0.1575 0.1594
va: 2.1109 1.9938 2.2455 3.7619 3.7922 3.8389 3.8913 3.8961 3.8232 4.1307 3.6735 3.9209 3.9528 3.8232 3.5775 3.9994 3.9223 3.6029 3.8253 3.6205 3.8601 3.9026 3.8780 3.8654 3.8625 1.0028 1.0314 0.9997 1.0194 0.9998 1.0024 1.0024 1.0043 0.9977 0.9979 1.0028 1.0032 1.0004 0.9967 0.9972 0.9942 1.0033 1.0040 0.9912 1.0141 1.0048 1.0048 1.0033 0.9925 0.9909 0.9906
dispcorr: -0.029399064 hartree
energy: -1079.764680532954
dipole: 9.92803 -9.51272 0.41531 -14.32321 14.56210 0.23889 -2.40062 1.64012 -0.76050
magnitude: 0.89884 au
magnitude: 2.28466 debye
