program: Orca
programVersion: 5.0.2
elementType: O O O C C C C C C C C C C C C C C C C C C C C C C H H H H H H H H H H H H H H H H H H H H H H H H H H
charge: 0
multiplicity: 1
keywords: wb97x-d3
keywords: def2-TZVPP
keywords: def2/J RIJCOSX
keywords: DEFGRID2
keywords: scfconv7
keywords: smallprint printgap noloewdin
keywords: NOSOSCF
formula: C22H26O3
InChI: InChI=1/C22H26O3/c1-15(2)10-19-20(22(19,3)4)21(23)25-14-17-12-18(24-13-17)11-16-8-6-5-7-9-16/h5-10,12-13,19-20H,11,14H2,1-4H3
51 atoms
O  2.297568 1.604039 0.273035
O  2.253444 2.063106 -1.912581
O  -1.880204 2.003036 1.344336
C  3.475521 -1.100317 -0.273462
C  2.072143 -1.290924 -0.755608
C  2.892541 -0.102866 -1.253736
C  3.764944 -0.768645 1.170008
C  4.520601 -2.013788 -0.87332
C  0.872035 -1.112785 0.104942
C  2.459365 1.28546 -1.00351
C  0.482213 -1.980741 1.042109
C  -0.769149 -1.760285 1.834402
C  1.239079 -3.22677 1.38289
C  1.603754 2.822135 0.609808
C  0.13898 2.570457 0.61416
C  -0.738397 2.414987 -0.509737
C  -0.613711 2.305475 1.706801
C  -1.945627 2.062549 -0.011325
C  -3.217709 1.644464 -0.652923
C  -3.361542 0.139733 -0.627668
C  -2.555983 -0.649413 -1.446159
C  -4.257849 -0.483414 0.233275
C  -2.647441 -2.032619 -1.408545
C  -4.353392 -1.869762 0.272497
C  -3.548182 -2.647879 -0.546938
H  1.957476 -2.054302 -1.521872
H  3.246392 -0.207737 -2.272869
H  3.999569 -1.692098 1.703172
H  4.637211 -0.118299 1.254809
H  2.937279 -0.29801 1.691642
H  5.513583 -1.563134 -0.822303
H  4.556837 -2.95835 -0.326606
H  4.311511 -2.243061 -1.918892
H  0.239432 -0.250464 -0.084184
H  -1.28605 -0.84496 1.545895
H  -0.544591 -1.69723 2.902533
H  -1.46295 -2.595946 1.714691
H  0.605072 -4.107007 1.247812
H  1.537651 -3.223728 2.434162
H  2.134112 -3.364703 0.778719
H  1.888071 3.629303 -0.064194
H  1.952259 3.077558 1.608508
H  -0.498782 2.536664 -1.553859
H  -0.392903 2.302263 2.763065
H  -3.209762 2.003165 -1.683224
H  -4.070832 2.112335 -0.15668
H  -1.847871 -0.175702 -2.116665
H  -4.889489 0.11795 0.876309
H  -2.015871 -2.631563 -2.052021
H  -5.05705 -2.340813 0.9468
H  -3.620396 -3.727272 -0.515938
elementType: O C H
totalener: -1079.73408228 hartree
nucrepener: 2278.42700373 hartree
electener: -3358.16108601 hartree
oneelecener: -5996.33261431 hartree
twoeener: 2638.17152830 hartree
cpcmener: -0.03030289 hartree
kineticenergy: 1074.85866819 hartree
xcener: -106.466281481238 hartree
chargesum: -0.0000000
charge: -0.266745 -0.505436 -0.280838 0.110111 -0.011230 -0.121174 -0.286297 -0.275318 -0.238114 0.422490 -0.005344 -0.268832 -0.267865 0.052227 -0.069560 -0.289900 -0.044443 0.189980 -0.037492 0.038184 -0.213355 -0.178134 -0.161657 -0.152408 -0.176660 0.109482 0.095063 0.094015 0.110886 0.093878 0.098345 0.092023 0.088763 0.100017 0.066966 0.116094 0.104414 0.108854 0.101464 0.091381 0.124533 0.115226 0.158798 0.178175 0.116833 0.108051 0.148375 0.140635 0.157354 0.158981 0.159201
qa: -0.2667 -0.5054 -0.2808 0.1101 -0.0112 -0.1212 -0.2863 -0.2753 -0.2381 0.4225 -0.0053 -0.2688 -0.2679 0.0522 -0.0696 -0.2899 -0.0444 0.1900 -0.0375 0.0382 -0.2134 -0.1781 -0.1617 -0.1524 -0.1767 0.1095 0.0951 0.0940 0.1109 0.0939 0.0983 0.0920 0.0888 0.1000 0.0670 0.1161 0.1044 0.1089 0.1015 0.0914 0.1245 0.1152 0.1588 0.1782 0.1168 0.1081 0.1484 0.1406 0.1574 0.1590 0.1592
va: 2.1139 1.9856 2.2577 3.6761 3.7667 3.8835 3.8748 3.9054 3.8269 4.1240 3.5900 3.9408 3.9278 3.8452 3.6184 3.9670 3.9236 3.6601 3.8047 3.5687 3.8631 3.9184 3.8375 3.8668 3.8413 1.0073 1.0268 0.9981 1.0040 1.0119 1.0014 1.0036 1.0049 0.9814 1.0063 1.0015 0.9949 1.0004 0.9956 1.0067 1.0082 1.0013 1.0193 0.9925 1.0080 1.0130 1.0014 1.0040 0.9926 0.9900 0.9906
dispcorr: -0.031362494 hartree
energy: -1079.765444774324
dipole: 10.03663 -10.12678 -0.09015 -19.02128 18.04172 -0.97956 6.19683 -5.11634 1.08050
magnitude: 1.46121 au
magnitude: 3.71411 debye
