program: Orca
programVersion: 5.0.2
elementType: O O O C C C C C C C C C C C C C C C C C C C C C C H H H H H H H H H H H H H H H H H H H H H H H H H H
charge: 0
multiplicity: 1
keywords: wb97x-d3
keywords: def2-TZVPP
keywords: def2/J RIJCOSX
keywords: DEFGRID2
keywords: scfconv7
keywords: smallprint printgap noloewdin
keywords: NOSOSCF
formula: C22H26O3
InChI: InChI=1/C22H26O3/c1-15(2)10-19-20(22(19,3)4)21(23)25-14-17-12-18(24-13-17)11-16-8-6-5-7-9-16/h5-10,12-13,19-20H,11,14H2,1-4H3
51 atoms
O  2.078526 1.880488 -1.014855
O  2.6544 1.214559 1.039789
O  -1.677559 1.798702 1.244573
C  4.174377 -1.129787 -0.29478
C  2.746059 -1.541796 -0.384255
C  3.177985 -0.144848 -0.867025
C  4.839609 -0.916399 1.043178
C  5.119212 -1.715756 -1.319345
C  1.876219 -1.712093 0.803216
C  2.644541 1.02571 -0.155963
C  0.542836 -1.646627 0.748008
C  -0.308319 -1.85634 1.960451
C  -0.181581 -1.345055 -0.53361
C  1.338492 2.986176 -0.46766
C  -0.012116 2.555498 -0.0134
C  -1.195308 2.445062 -0.815985
C  -0.371553 2.144119 1.225814
C  -2.17643 1.986491 -0.004737
C  -3.600318 1.625634 -0.235233
C  -3.791411 0.129187 -0.309859
C  -3.919457 -0.632098 0.849037
C  -3.788627 -0.518925 -1.541718
C  -4.034506 -2.014087 0.778038
C  -3.908971 -1.899997 -1.616196
C  -4.026838 -2.652599 -0.455343
H  2.498457 -2.190495 -1.221346
H  3.204434 -0.029507 -1.944187
H  5.650062 -0.190822 0.956239
H  4.1714 -0.573641 1.826923
H  5.280601 -1.857659 1.377036
H  5.971459 -1.054732 -1.486699
H  5.506474 -2.676581 -0.975416
H  4.629434 -1.879458 -2.280129
H  2.351962 -1.923002 1.755834
H  -1.004091 -2.686517 1.813061
H  -0.922919 -0.973713 2.15897
H  0.28473 -2.063893 2.850975
H  0.051132 -2.075711 -1.311926
H  0.09383 -0.366748 -0.933652
H  -1.262192 -1.351086 -0.39625
H  1.257061 3.695928 -1.288716
H  1.899533 3.466359 0.334162
H  -1.295522 2.685031 -1.863151
H  0.161294 2.063035 2.159784
H  -3.917006 2.088384 -1.17051
H  -4.224301 2.046775 0.557131
H  -3.932128 -0.143049 1.815891
H  -3.691783 0.062425 -2.451121
H  -4.131421 -2.592318 1.687921
H  -3.908603 -2.388926 -2.581903
H  -4.117038 -3.729606 -0.51134
elementType: O C H
totalener: -1079.73719368 hartree
nucrepener: 2249.39247715 hartree
electener: -3329.12967083 hartree
oneelecener: -5938.84206319 hartree
twoeener: 2609.71239236 hartree
cpcmener: -0.02943335 hartree
kineticenergy: 1074.85308689 hartree
xcener: -106.464569257281 hartree
chargesum: 0.0000000
charge: -0.295430 -0.493810 -0.283538 0.140480 -0.022572 -0.105189 -0.296682 -0.267402 -0.276964 0.398723 0.000390 -0.240953 -0.212320 0.084600 -0.045363 -0.352790 -0.036189 0.209730 -0.059972 0.076337 -0.208310 -0.212728 -0.167602 -0.142926 -0.165980 0.113732 0.092366 0.102210 0.089699 0.099086 0.096430 0.094614 0.087716 0.127266 0.103243 0.090642 0.098918 0.117556 0.090747 0.010319 0.120539 0.120910 0.159401 0.169655 0.108545 0.117740 0.143517 0.141564 0.160344 0.159100 0.160600
qa: -0.2954 -0.4938 -0.2835 0.1405 -0.0226 -0.1052 -0.2967 -0.2674 -0.2770 0.3987 0.0004 -0.2410 -0.2123 0.0846 -0.0454 -0.3528 -0.0362 0.2097 -0.0600 0.0763 -0.2083 -0.2127 -0.1676 -0.1429 -0.1660 0.1137 0.0924 0.1022 0.0897 0.0991 0.0964 0.0946 0.0877 0.1273 0.1032 0.0906 0.0989 0.1176 0.0907 0.0103 0.1205 0.1209 0.1594 0.1697 0.1085 0.1177 0.1435 0.1416 0.1603 0.1591 0.1606
va: 2.0980 1.9878 2.2539 3.7665 3.7996 3.8369 3.8867 3.8974 3.8113 4.1019 3.6515 3.9033 3.9448 3.8205 3.5562 3.9810 3.9153 3.5815 3.8125 3.5335 3.8784 3.9120 3.8516 3.8647 3.8603 1.0053 1.0332 1.0001 1.0185 0.9986 1.0024 1.0024 1.0044 1.0003 0.9950 0.9985 1.0132 1.0061 1.0076 1.0414 0.9940 1.0107 1.0084 1.0073 1.0108 1.0070 1.0099 1.0043 0.9908 0.9899 0.9892
dispcorr: -0.030258347 hartree
energy: -1079.767452025578
dipole: 9.90446 -10.41364 -0.50918 -14.06231 13.94502 -0.11728 -1.02511 -0.26642 -1.29152
magnitude: 1.39321 au
magnitude: 3.54127 debye
