program: Orca
programVersion: 5.0.2
elementType: O O O C C C C C C C C C C C C C C C C C C C C C C H H H H H H H H H H H H H H H H H H H H H H H H H H
charge: 0
multiplicity: 1
keywords: wb97x-d3
keywords: def2-TZVPP
keywords: def2/J RIJCOSX
keywords: DEFGRID2
keywords: scfconv7
keywords: smallprint printgap noloewdin
keywords: NOSOSCF
formula: C22H26O3
InChI: InChI=1/C22H26O3/c1-15(2)10-19-20(22(19,3)4)21(23)25-14-17-12-18(24-13-17)11-16-8-6-5-7-9-16/h5-10,12-13,19-20H,11,14H2,1-4H3
51 atoms
O  2.017389 0.95033 0.808813
O  2.640044 2.281418 -0.867433
O  -1.651178 3.188527 -0.43526
C  4.217573 -0.941811 -0.235811
C  2.887685 -1.440819 -0.691791
C  3.279843 0.015188 -0.953994
C  4.531305 -0.776923 1.230881
C  5.42523 -1.359982 -1.042594
C  1.813409 -1.85178 0.243185
C  2.627503 1.188961 -0.344825
C  0.560666 -2.152225 -0.110455
C  -0.442661 -2.609683 0.904147
C  0.039538 -2.037275 -1.509732
C  1.280199 2.02012 1.417456
C  -0.013039 2.246203 0.722039
C  -1.089594 1.309191 0.587823
C  -0.413593 3.362671 0.074879
C  -2.057234 1.934979 -0.12303
C  -3.41073 1.531157 -0.594893
C  -3.720046 0.102113 -0.241274
C  -4.111483 -0.238143 1.05142
C  -3.597683 -0.907928 -1.190093
C  -4.373141 -1.558603 1.387866
C  -3.85986 -2.230919 -0.857551
C  -4.247916 -2.559945 0.43304
H  2.919814 -2.021139 -1.60967
H  3.565459 0.23024 -1.977472
H  3.677791 -0.510407 1.848082
H  4.938657 -1.710107 1.625876
H  5.291597 -0.005829 1.371307
H  5.826033 -2.306166 -0.672523
H  5.18395 -1.4938 -2.097961
H  6.220063 -0.614249 -0.975319
H  2.080212 -1.947016 1.291136
H  -0.816223 -3.610316 0.669065
H  -1.317787 -1.953866 0.917728
H  -0.027175 -2.634939 1.912072
H  0.801024 -1.752937 -2.23423
H  -0.752428 -1.284874 -1.555594
H  -0.408415 -2.977577 -1.84142
H  1.876257 2.933338 1.45905
H  1.116315 1.683143 2.440549
H  -1.126591 0.30632 0.98239
H  0.056521 4.318672 -0.097464
H  -3.475255 1.668145 -1.678273
H  -4.162271 2.196648 -0.15777
H  -4.212751 0.537407 1.802098
H  -3.296619 -0.658326 -2.200852
H  -4.676859 -1.805906 2.397255
H  -3.758404 -3.003862 -1.608923
H  -4.451004 -3.590451 0.695261
elementType: O C H
totalener: -1079.74839379 hartree
nucrepener: 2226.74123563 hartree
electener: -3306.48962942 hartree
oneelecener: -5892.67990759 hartree
twoeener: 2586.19027817 hartree
cpcmener: -0.02634903 hartree
kineticenergy: 1074.86664716 hartree
xcener: -106.467984252556 hartree
chargesum: 0.0000000
charge: -0.266854 -0.476634 -0.281871 0.140995 -0.041070 -0.129803 -0.294604 -0.264395 -0.192900 0.417138 -0.042771 -0.219584 -0.283312 0.056811 -0.075364 -0.346444 -0.022191 0.200781 -0.011639 0.047849 -0.206039 -0.241199 -0.123382 -0.131414 -0.185681 0.109591 0.090898 0.090792 0.099888 0.102133 0.092659 0.086349 0.096072 0.121017 0.109532 0.028328 0.098121 0.098265 0.091713 0.104752 0.119332 0.114918 0.184803 0.173575 0.102031 0.109289 0.139968 0.144815 0.154619 0.154853 0.155263
qa: -0.2669 -0.4766 -0.2819 0.1410 -0.0411 -0.1298 -0.2946 -0.2644 -0.1929 0.4171 -0.0428 -0.2196 -0.2833 0.0568 -0.0754 -0.3464 -0.0222 0.2008 -0.0116 0.0478 -0.2060 -0.2412 -0.1234 -0.1314 -0.1857 0.1096 0.0909 0.0908 0.0999 0.1021 0.0927 0.0863 0.0961 0.1210 0.1095 0.0283 0.0981 0.0983 0.0917 0.1048 0.1193 0.1149 0.1848 0.1736 0.1020 0.1093 0.1400 0.1448 0.1546 0.1549 0.1553
va: 2.1069 2.0331 2.2769 3.7564 3.7826 3.8773 3.9043 3.8993 3.7877 4.1316 3.6601 3.9351 3.9446 3.8560 3.6845 3.9643 3.9654 3.6759 3.8398 3.5568 3.9269 3.9089 3.8392 3.8223 3.8815 1.0035 1.0291 1.0130 0.9988 0.9999 1.0023 1.0054 1.0020 1.0038 0.9965 1.0046 1.0144 1.0127 1.0010 0.9978 1.0066 0.9927 0.9768 0.9973 1.0100 1.0027 1.0037 1.0016 0.9907 0.9924 0.9919
dispcorr: -0.028995404 hartree
energy: -1079.777389191177
dipole: 10.20675 -10.56497 -0.35822 -18.60433 17.37397 -1.23036 1.03691 -0.34824 0.68867
magnitude: 1.45478 au
magnitude: 3.69775 debye
