program: Orca
programVersion: 5.0.2
elementType: O O O C C C C C C C C C C C C C C C C C C C C C C H H H H H H H H H H H H H H H H H H H H H H H H H H
charge: 0
multiplicity: 1
keywords: wb97x-d3
keywords: def2-TZVPP
keywords: def2/J RIJCOSX
keywords: DEFGRID2
keywords: scfconv7
keywords: smallprint printgap noloewdin
keywords: NOSOSCF
formula: C22H26O3
InChI: InChI=1/C22H26O3/c1-15(2)10-19-20(22(19,3)4)21(23)25-14-17-12-18(24-13-17)11-16-8-6-5-7-9-16/h5-10,12-13,19-20H,11,14H2,1-4H3
51 atoms
O  1.781602 1.033652 -1.221065
O  1.650951 -0.953032 -0.209465
O  -2.409743 2.214458 -0.295878
C  3.93883 0.16074 1.600266
C  4.604235 -0.574139 0.48997
C  3.539875 0.475526 0.167715
C  2.989481 -0.548343 2.533614
C  4.731167 1.248679 2.286405
C  4.401446 -2.026837 0.258746
C  2.24326 0.081591 -0.407446
C  4.446775 -2.630619 -0.930917
C  4.268791 -4.112313 -1.061106
C  4.642936 -1.895875 -2.220621
C  0.544802 0.797482 -1.910999
C  -0.643027 1.118215 -1.075123
C  -1.228482 0.365397 -0.003248
C  -1.409373 2.227485 -1.198484
C  -2.293751 1.077575 0.430724
C  -3.3232 0.822205 1.470882
C  -4.673679 0.521335 0.86578
C  -4.950437 -0.75026 0.369378
C  -5.648432 1.508032 0.763793
C  -6.178606 -1.031848 -0.210278
C  -6.87862 1.230047 0.180853
C  -7.147557 -0.040804 -0.306745
H  5.600849 -0.217334 0.240882
H  3.920674 1.414322 -0.217183
H  2.454352 -1.376838 2.077698
H  3.54612 -0.946747 3.384588
H  2.247073 0.148468 2.928044
H  5.413187 1.752412 1.599969
H  4.071012 2.005164 2.715578
H  5.329542 0.831809 3.099407
H  4.235056 -2.640479 1.139862
H  4.103812 -4.593958 -0.097146
H  5.143304 -4.576762 -1.524879
H  3.417197 -4.348609 -1.704949
H  4.798095 -0.826324 -2.08967
H  3.776056 -2.030227 -2.873796
H  5.502259 -2.292617 -2.767873
H  0.509638 -0.228184 -2.281379
H  0.580975 1.460018 -2.774929
H  -0.905654 -0.585263 0.38779
H  -1.361822 3.076757 -1.863077
H  -3.398456 1.680055 2.14456
H  -2.985087 -0.022839 2.072844
H  -4.198085 -1.527887 0.439592
H  -5.448126 2.501711 1.147269
H  -6.380923 -2.027317 -0.585131
H  -7.628354 2.0081 0.11058
H  -8.107067 -0.259604 -0.757758
elementType: O C H
totalener: -1079.75086839 hartree
nucrepener: 2082.70578033 hartree
electener: -3162.45664872 hartree
oneelecener: -5605.14896197 hartree
twoeener: 2442.69231325 hartree
cpcmener: -0.02543594 hartree
kineticenergy: 1074.86816148 hartree
xcener: -106.462176904275 hartree
chargesum: 0.0000000
charge: -0.290927 -0.475360 -0.279270 0.134027 -0.025703 -0.102378 -0.300575 -0.264451 -0.262062 0.411464 -0.022562 -0.225273 -0.266496 0.067010 -0.088105 -0.305707 -0.036172 0.198250 -0.062342 0.052757 -0.198596 -0.191240 -0.155937 -0.157019 -0.171629 0.112963 0.093628 0.097080 0.099271 0.099437 0.086193 0.095354 0.093496 0.119770 0.088626 0.094760 0.093766 0.092305 0.097725 0.106644 0.117929 0.115555 0.161558 0.174074 0.111467 0.115024 0.142104 0.139169 0.157136 0.155677 0.157590
qa: -0.2909 -0.4754 -0.2793 0.1340 -0.0257 -0.1024 -0.3006 -0.2645 -0.2621 0.4115 -0.0226 -0.2253 -0.2665 0.0670 -0.0881 -0.3057 -0.0362 0.1983 -0.0623 0.0528 -0.1986 -0.1912 -0.1559 -0.1570 -0.1716 0.1130 0.0936 0.0971 0.0993 0.0994 0.0862 0.0954 0.0935 0.1198 0.0886 0.0948 0.0938 0.0923 0.0977 0.1066 0.1179 0.1156 0.1616 0.1741 0.1115 0.1150 0.1421 0.1392 0.1571 0.1557 0.1576
va: 2.1129 2.0079 2.2800 3.7328 3.8322 3.8305 3.8998 3.9003 3.8572 4.0598 3.7133 3.9267 3.9433 3.8699 3.6660 4.0102 3.9707 3.6573 3.8188 3.5813 3.9443 3.9554 3.9030 3.8987 3.9006 1.0049 1.0301 1.0145 0.9986 1.0013 1.0050 1.0021 1.0022 1.0006 1.0074 0.9964 0.9968 1.0062 0.9984 0.9990 1.0059 0.9984 1.0202 0.9942 1.0073 1.0079 1.0035 1.0058 0.9909 0.9912 0.9904
dispcorr: -0.023255929 hartree
energy: -1079.774124317295
dipole: 23.29637 -22.73459 0.56178 -10.96078 11.44669 0.48592 3.57261 -3.74107 -0.16847
magnitude: 0.76164 au
magnitude: 1.93593 debye
