program: Orca
programVersion: 5.0.2
elementType: O O O C C C C C C C C C C C C C C C C C C C C C C H H H H H H H H H H H H H H H H H H H H H H H H H H
charge: 0
multiplicity: 1
keywords: wb97x-d3
keywords: def2-TZVPP
keywords: def2/J RIJCOSX
keywords: DEFGRID2
keywords: scfconv7
keywords: smallprint printgap noloewdin
keywords: NOSOSCF
formula: C22H26O3
InChI: InChI=1/C22H26O3/c1-15(2)10-19-20(22(19,3)4)21(23)25-14-17-12-18(24-13-17)11-16-8-6-5-7-9-16/h5-10,12-13,19-20H,11,14H2,1-4H3
51 atoms
O  2.141609 2.05782 0.185151
O  2.183156 0.281688 1.53999
O  -2.023095 1.54563 -1.190487
C  4.885994 -0.458358 0.229686
C  3.863979 -0.929415 -0.745552
C  3.808749 0.511188 -0.208002
C  4.937044 -1.011453 1.632755
C  6.259378 -0.147528 -0.320727
C  2.816929 -1.922165 -0.410592
C  2.654718 0.903245 0.61713
C  1.688596 -2.062402 -1.111843
C  0.674315 -3.106684 -0.766675
C  1.364619 -1.173296 -2.280941
C  0.908846 2.513411 0.765928
C  -0.265866 1.856728 0.130411
C  -0.770461 0.527202 0.323232
C  -1.071882 2.417511 -0.802152
C  -1.834196 0.394415 -0.503057
C  -2.808282 -0.706287 -0.727599
C  -4.100747 -0.478888 0.020152
C  -5.077267 0.377292 -0.482628
C  -4.320348 -1.099052 1.246417
C  -6.246028 0.610965 0.22868
C  -5.490342 -0.870673 1.957986
C  -6.456537 -0.012499 1.451573
H  4.18753 -0.952942 -1.783484
H  4.123975 1.272131 -0.912344
H  5.584321 -1.890873 1.652483
H  5.366312 -0.276807 2.316863
H  3.971358 -1.305743 2.032144
H  6.772122 0.59096 0.298965
H  6.876908 -1.047966 -0.34324
H  6.213976 0.246117 -1.337308
H  2.996121 -2.583514 0.431259
H  0.973222 -3.707066 0.092889
H  0.501493 -3.783491 -1.608034
H  -0.292476 -2.649418 -0.538176
H  0.363731 -1.365867 -2.667883
H  2.063456 -1.323058 -3.10836
H  1.415652 -0.114763 -2.015917
H  0.88952 3.585399 0.573644
H  0.918243 2.369638 1.846954
H  -0.398479 -0.226667 0.997613
H  -1.08446 3.392119 -1.265957
H  -2.348856 -1.636842 -0.391973
H  -3.004438 -0.817326 -1.797529
H  -4.92699 0.863932 -1.439338
H  -3.56861 -1.768477 1.648649
H  -6.996098 1.279426 -0.175011
H  -5.646919 -1.365282 2.908426
H  -7.369626 0.166678 2.004847
elementType: O C H
totalener: -1079.74876173 hartree
nucrepener: 2164.31284145 hartree
electener: -3244.06160319 hartree
oneelecener: -5768.12253435 hartree
twoeener: 2524.06093117 hartree
cpcmener: -0.02532091 hartree
kineticenergy: 1074.85803438 hartree
xcener: -106.460989194739 hartree
chargesum: -0.0000000
charge: -0.288760 -0.469043 -0.282271 0.133691 -0.036821 -0.098443 -0.296406 -0.264140 -0.246842 0.397740 -0.024682 -0.204732 -0.294128 0.067707 -0.079493 -0.337047 -0.034602 0.245914 -0.058032 0.047009 -0.208571 -0.202728 -0.153735 -0.143764 -0.175043 0.111040 0.090785 0.097452 0.099795 0.093468 0.095204 0.094269 0.085328 0.121117 0.089689 0.103691 0.072045 0.100205 0.116515 0.092381 0.115515 0.117448 0.158288 0.173696 0.112221 0.119430 0.138266 0.139903 0.155965 0.156521 0.156984
qa: -0.2888 -0.4690 -0.2823 0.1337 -0.0368 -0.0984 -0.2964 -0.2641 -0.2468 0.3977 -0.0247 -0.2047 -0.2941 0.0677 -0.0795 -0.3370 -0.0346 0.2459 -0.0580 0.0470 -0.2086 -0.2027 -0.1537 -0.1438 -0.1750 0.1110 0.0908 0.0975 0.0998 0.0935 0.0952 0.0943 0.0853 0.1211 0.0897 0.1037 0.0720 0.1002 0.1165 0.0924 0.1155 0.1174 0.1583 0.1737 0.1122 0.1194 0.1383 0.1399 0.1560 0.1565 0.1570
va: 2.1020 2.0171 2.2785 3.7705 3.8133 3.8364 3.8899 3.8973 3.8006 4.0979 3.6717 3.9085 3.9475 3.8704 3.6531 3.9705 3.9717 3.5771 3.7989 3.6071 3.9679 3.9397 3.9022 3.8927 3.9040 1.0037 1.0330 0.9988 1.0005 1.0194 1.0027 1.0023 1.0048 1.0025 1.0099 0.9958 0.9970 1.0050 1.0010 0.9992 0.9970 1.0079 1.0210 0.9948 1.0066 1.0075 1.0131 1.0040 0.9913 0.9911 0.9907
dispcorr: -0.026636926 hartree
energy: -1079.775398658097
dipole: 16.56058 -16.33923 0.22136 -12.37036 12.54250 0.17214 -3.05404 2.20651 -0.84753
magnitude: 0.89271 au
magnitude: 2.26909 debye
