program: Orca
programVersion: 5.0.2
elementType: O O O C C C C C C C C C C C C C C C C C C C C C C H H H H H H H H H H H H H H H H H H H H H H H H H H
charge: 0
multiplicity: 1
keywords: wb97x-d3
keywords: def2-TZVPP
keywords: def2/J RIJCOSX
keywords: DEFGRID2
keywords: scfconv7
keywords: smallprint printgap noloewdin
keywords: NOSOSCF
formula: C22H26O3
InChI: InChI=1/C22H26O3/c1-15(2)10-19-20(22(19,3)4)21(23)25-14-17-12-18(24-13-17)11-16-8-6-5-7-9-16/h5-10,12-13,19-20H,11,14H2,1-4H3
51 atoms
O  0.815102 -1.144022 0.659559
O  2.142128 0.570524 1.197716
O  -1.752569 2.397577 0.155468
C  3.866601 -0.353223 -1.229783
C  4.402382 -1.09457 -0.055261
C  2.898762 -1.111134 -0.33681
C  3.884674 1.154839 -1.258851
C  4.079417 -0.967475 -2.593731
C  4.998594 -0.406452 1.118031
C  1.952557 -0.448315 0.576457
C  4.946241 -0.846215 2.376994
C  5.617121 -0.105061 3.493236
C  4.20184 -2.078742 2.787391
C  -0.215948 -0.635581 1.520327
C  -1.025153 0.425045 0.858902
C  -2.202569 0.235621 0.063737
C  -0.805856 1.761273 0.873908
C  -2.602516 1.465509 -0.337013
C  -3.725425 1.957319 -1.18315
C  -4.782861 0.903488 -1.369468
C  -4.775468 0.070874 -2.483981
C  -5.776841 0.729669 -0.409193
C  -5.744268 -0.913013 -2.640211
C  -6.746604 -0.250539 -0.562556
C  -6.733065 -1.075692 -1.680092
H  4.860123 -2.053051 -0.289162
H  2.521695 -2.037827 -0.753993
H  3.068888 1.537045 -1.875337
H  3.803736 1.619272 -0.28027
H  4.819057 1.497756 -1.707776
H  3.31252 -0.63848 -3.297828
H  5.049599 -0.671933 -2.998848
H  4.053985 -2.057349 -2.559631
H  5.548672 0.508609 0.915473
H  6.12013 0.797472 3.145949
H  6.35924 -0.733657 3.992348
H  4.89359 0.186066 4.259459
H  3.795598 -2.638121 1.946855
H  3.370802 -1.822775 3.450535
H  4.848736 -2.752936 3.354148
H  0.212107 -0.283587 2.458322
H  -0.838079 -1.50021 1.742607
H  -2.683084 -0.703129 -0.164018
H  -0.057987 2.38051 1.343511
H  -3.341611 2.277741 -2.156979
H  -4.163508 2.84576 -0.719428
H  -4.008282 0.19417 -3.239754
H  -5.794523 1.371083 0.464567
H  -5.727571 -1.549923 -3.515624
H  -7.516039 -0.368589 0.190053
H  -7.490624 -1.839454 -1.802076
elementType: O C H
totalener: -1079.75057743 hartree
nucrepener: 2078.36127053 hartree
electener: -3158.11184796 hartree
oneelecener: -5596.29406088 hartree
twoeener: 2438.18221292 hartree
cpcmener: -0.02424411 hartree
kineticenergy: 1074.85690320 hartree
xcener: -106.461153696417 hartree
chargesum: -0.0000000
charge: -0.293206 -0.472743 -0.279036 0.133008 -0.023735 -0.108518 -0.300712 -0.264639 -0.268787 0.399548 -0.019817 -0.224701 -0.266139 0.091408 -0.107241 -0.297880 -0.012652 0.168725 -0.000442 -0.001102 -0.183207 -0.194016 -0.155870 -0.150108 -0.165906 0.113621 0.093236 0.100048 0.097476 0.098441 0.094646 0.093451 0.086025 0.119680 0.088961 0.094808 0.093611 0.093599 0.098712 0.105711 0.119212 0.117522 0.162000 0.168562 0.103234 0.105922 0.138911 0.139820 0.156553 0.156113 0.157897
qa: -0.2932 -0.4727 -0.2790 0.1330 -0.0237 -0.1085 -0.3007 -0.2646 -0.2688 0.3995 -0.0198 -0.2247 -0.2661 0.0914 -0.1072 -0.2979 -0.0127 0.1687 -0.0004 -0.0011 -0.1832 -0.1940 -0.1559 -0.1501 -0.1659 0.1136 0.0932 0.1000 0.0975 0.0984 0.0946 0.0935 0.0860 0.1197 0.0890 0.0948 0.0936 0.0936 0.0987 0.1057 0.1192 0.1175 0.1620 0.1686 0.1032 0.1059 0.1389 0.1398 0.1566 0.1561 0.1579
va: 2.1116 2.0103 2.2808 3.7324 3.8290 3.8370 3.8986 3.9017 3.8605 4.0906 3.7116 3.9259 3.9429 3.8150 3.6681 3.9904 3.9505 3.6848 3.8110 3.6384 3.9211 3.9362 3.8986 3.8942 3.8942 1.0049 1.0309 1.0010 1.0153 0.9982 1.0024 1.0021 1.0050 1.0008 1.0073 0.9967 0.9966 1.0060 0.9983 0.9994 1.0102 0.9959 1.0024 1.0078 1.0037 1.0091 1.0045 1.0035 0.9910 0.9909 0.9901
dispcorr: -0.023313594 hartree
energy: -1079.773891026550
dipole: 23.99499 -24.26780 -0.27281 -6.27716 5.35316 -0.92399 1.49466 -1.87069 -0.37603
magnitude: 1.03421 au
magnitude: 2.62874 debye
