program: Orca
programVersion: 5.0.2
elementType: O O O C C C C C C C C C C C C C C C C C C C C C C H H H H H H H H H H H H H H H H H H H H H H H H H H
charge: 0
multiplicity: 1
keywords: wb97x-d3
keywords: def2-TZVPP
keywords: def2/J RIJCOSX
keywords: DEFGRID2
keywords: scfconv7
keywords: smallprint printgap noloewdin
keywords: NOSOSCF
formula: C22H26O3
InChI: InChI=1/C22H26O3/c1-15(2)10-19-20(22(19,3)4)21(23)25-14-17-12-18(24-13-17)11-16-8-6-5-7-9-16/h5-10,12-13,19-20H,11,14H2,1-4H3
51 atoms
O  2.217718 2.085822 0.282261
O  1.688908 0.213173 1.378362
O  -1.566488 2.254751 -1.790432
C  4.437843 -0.869296 0.374262
C  3.456925 -1.178331 -0.70066
C  3.548828 0.248205 -0.137463
C  4.268897 -1.431877 1.764104
C  5.888081 -0.748286 -0.033465
C  2.264287 -2.027538 -0.477362
C  2.404026 0.802687 0.602491
C  1.136636 -1.927926 -1.184957
C  -0.040526 -2.807318 -0.904149
C  0.957405 -0.89257 -2.259275
C  1.020242 2.730232 0.745025
C  -0.154441 2.336666 -0.082015
C  -1.134901 1.320228 0.168529
C  -0.47205 2.859232 -1.289889
C  -1.969737 1.317863 -0.898844
C  -3.170301 0.521792 -1.277103
C  -3.796981 -0.186407 -0.106336
C  -3.820203 -1.574921 -0.039366
C  -4.388131 0.542714 0.924496
C  -4.421414 -2.225046 1.03204
C  -4.988694 -0.102176 1.994571
C  -5.00744 -1.490978 2.051803
H  3.869393 -1.234613 -1.705666
H  4.038584 0.965433 -0.785863
H  3.234689 -1.572562 2.064974
H  4.765093 -2.402808 1.826911
H  4.740854 -0.777496 2.499781
H  6.377295 -1.72416 -0.002339
H  5.996997 -0.357174 -1.046141
H  6.432093 -0.083008 0.640202
H  2.323448 -2.775343 0.307702
H  -0.339342 -3.369437 -1.793027
H  -0.908001 -2.208181 -0.611449
H  0.158653 -3.519582 -0.103254
H  1.823342 -0.826747 -2.920593
H  0.812789 0.104214 -1.832375
H  0.084814 -1.103117 -2.878708
H  1.226743 3.793959 0.635885
H  0.85231 2.529494 1.803707
H  -1.207127 0.687334 1.038572
H  -0.033905 3.646486 -1.884652
H  -2.902446 -0.206528 -2.049018
H  -3.905738 1.190035 -1.736332
H  -3.37069 -2.156922 -0.835409
H  -4.381678 1.626105 0.887258
H  -4.432357 -3.307114 1.065754
H  -5.446383 0.479562 2.784797
H  -5.479027 -1.995145 2.885646
elementType: O C H
totalener: -1079.74836038 hartree
nucrepener: 2202.62573640 hartree
electener: -3282.37409678 hartree
oneelecener: -5844.95404137 hartree
twoeener: 2562.57994459 hartree
cpcmener: -0.02525125 hartree
kineticenergy: 1074.85347873 hartree
xcener: -106.461615017958 hartree
chargesum: -0.0000000
charge: -0.288197 -0.465096 -0.277639 0.124798 -0.022859 -0.088544 -0.297987 -0.263662 -0.249828 0.370959 -0.015940 -0.194861 -0.285826 0.071165 -0.091811 -0.284560 -0.031312 0.190429 -0.040952 0.023510 -0.187229 -0.218701 -0.154221 -0.140110 -0.171110 0.111475 0.090395 0.095279 0.098557 0.099093 0.093359 0.085768 0.095437 0.120394 0.097436 0.066243 0.088378 0.111720 0.085682 0.102758 0.119910 0.115631 0.156340 0.172904 0.104450 0.115793 0.149750 0.143236 0.155625 0.157081 0.156889
qa: -0.2882 -0.4651 -0.2776 0.1248 -0.0229 -0.0885 -0.2980 -0.2637 -0.2498 0.3710 -0.0159 -0.1949 -0.2858 0.0712 -0.0918 -0.2846 -0.0313 0.1904 -0.0410 0.0235 -0.1872 -0.2187 -0.1542 -0.1401 -0.1711 0.1115 0.0904 0.0953 0.0986 0.0991 0.0934 0.0858 0.0954 0.1204 0.0974 0.0662 0.0884 0.1117 0.0857 0.1028 0.1199 0.1156 0.1563 0.1729 0.1044 0.1158 0.1498 0.1432 0.1556 0.1571 0.1569
va: 2.1065 2.0207 2.2686 3.7622 3.8225 3.8284 3.8929 3.8972 3.8213 4.1252 3.6710 3.9182 3.9717 3.8636 3.6471 3.8957 3.9443 3.6207 3.8025 3.5802 3.9093 3.9542 3.9137 3.8806 3.9088 1.0057 1.0324 1.0178 0.9982 1.0007 1.0024 1.0048 1.0025 1.0005 0.9970 0.9986 1.0126 1.0014 0.9906 1.0046 0.9953 1.0080 1.0158 0.9955 1.0071 1.0067 0.9957 1.0016 0.9924 0.9905 0.9906
dispcorr: -0.027663842 hartree
energy: -1079.776024223272
dipole: 13.18582 -12.97340 0.21241 -13.67748 14.01065 0.33317 -1.59197 0.87559 -0.71638
magnitude: 0.81812 au
magnitude: 2.07950 debye
