program: Orca
programVersion: 5.0.2
elementType: O O O C C C C C C C C C C C C C C C C C C C C C C H H H H H H H H H H H H H H H H H H H H H H H H H H
charge: 0
multiplicity: 1
keywords: wb97x-d3
keywords: def2-TZVPP
keywords: def2/J RIJCOSX
keywords: DEFGRID2
keywords: scfconv7
keywords: smallprint printgap noloewdin
keywords: NOSOSCF
formula: C22H26O3
InChI: InChI=1/C22H26O3/c1-15(2)10-19-20(22(19,3)4)21(23)25-14-17-12-18(24-13-17)11-16-8-6-5-7-9-16/h5-10,12-13,19-20H,11,14H2,1-4H3
51 atoms
O  2.057047 1.451597 0.197528
O  4.131553 2.242132 0.002443
O  -2.020056 2.210838 -0.709048
C  3.165867 -1.295891 0.54086
C  2.950584 -1.112558 -0.927266
C  3.784033 -0.093699 -0.155721
C  2.040893 -1.150922 1.538922
C  4.16825 -2.348641 0.956701
C  1.656295 -0.739367 -1.558414
C  3.359699 1.308626 0.024538
C  0.544408 -1.47764 -1.560162
C  -0.70104 -0.996059 -2.241788
C  0.425378 -2.815261 -0.898834
C  1.474274 2.763022 0.199443
C  0.008934 2.53984 0.121603
C  -0.856803 2.088798 1.168916
C  -0.757825 2.590702 -0.992512
C  -2.075069 1.903444 0.608649
C  -3.356914 1.36716 1.136028
C  -3.520028 -0.095944 0.793959
C  -4.3107 -0.501139 -0.275745
C  -2.838012 -1.06287 1.52921
C  -4.41905 -1.847371 -0.604884
C  -2.946932 -2.407075 1.205713
C  -3.736563 -2.803539 0.132914
H  3.575426 -1.746293 -1.553548
H  4.854976 -0.156914 -0.31063
H  1.696994 -2.142907 1.8375
H  2.385154 -0.646336 2.444229
H  1.177195 -0.612155 1.16029
H  4.996032 -2.432512 0.25107
H  4.590452 -2.120997 1.937823
H  3.689946 -3.328459 1.023566
H  1.639193 0.197747 -2.107746
H  -1.044474 -1.711234 -2.994056
H  -0.557077 -0.033886 -2.733216
H  -1.520577 -0.889174 -1.524884
H  0.112859 -3.569986 -1.626234
H  -0.346691 -2.802057 -0.124852
H  1.354407 -3.157439 -0.446455
H  1.830086 3.33791 -0.657502
H  1.757299 3.294782 1.109959
H  -0.595704 1.917638 2.201998
H  -0.549269 2.875758 -2.0126
H  -4.198433 1.942769 0.742857
H  -3.359545 1.499156 2.219123
H  -4.848197 0.23836 -0.857994
H  -2.214923 -0.760166 2.363405
H  -5.038552 -2.148397 -1.440364
H  -2.415683 -3.146141 1.792363
H  -3.824662 -3.85273 -0.118986
elementType: O C H
totalener: -1079.74676091 hartree
nucrepener: 2257.04133966 hartree
electener: -3336.78810057 hartree
oneelecener: -5952.94566700 hartree
twoeener: 2616.15756643 hartree
cpcmener: -0.02739690 hartree
kineticenergy: 1074.86344591 hartree
xcener: -106.463479640498 hartree
chargesum: -0.0000000
charge: -0.249203 -0.479689 -0.271540 0.073979 0.003485 -0.087491 -0.257350 -0.273685 -0.258267 0.382243 -0.005164 -0.205762 -0.279242 0.077155 -0.063773 -0.337946 -0.056655 0.212238 -0.060871 0.045195 -0.176843 -0.184114 -0.155529 -0.183584 -0.159233 0.110218 0.090913 0.092539 0.114489 0.071432 0.086856 0.098769 0.090467 0.111150 0.110761 0.093459 0.039686 0.109393 0.096278 0.097916 0.108779 0.116941 0.160170 0.175850 0.110351 0.115544 0.137403 0.140381 0.155276 0.159362 0.157262
qa: -0.2492 -0.4797 -0.2715 0.0740 0.0035 -0.0875 -0.2574 -0.2737 -0.2583 0.3822 -0.0052 -0.2058 -0.2792 0.0772 -0.0638 -0.3379 -0.0567 0.2122 -0.0609 0.0452 -0.1768 -0.1841 -0.1555 -0.1836 -0.1592 0.1102 0.0909 0.0925 0.1145 0.0714 0.0869 0.0988 0.0905 0.1112 0.1108 0.0935 0.0397 0.1094 0.0963 0.0979 0.1088 0.1169 0.1602 0.1758 0.1104 0.1155 0.1374 0.1404 0.1553 0.1594 0.1573
va: 2.0973 2.0289 2.2641 3.7081 3.7915 3.8692 3.8797 3.9156 3.8612 4.1528 3.6288 3.9192 3.9440 3.8601 3.7062 3.9753 3.9173 3.6015 3.8171 3.5741 3.9115 3.8829 3.8835 3.8755 3.8612 1.0056 1.0266 1.0006 1.0032 1.0068 1.0058 1.0004 1.0033 1.0136 1.0008 1.0097 1.0124 1.0005 0.9981 1.0072 1.0047 0.9931 1.0072 0.9950 1.0125 1.0079 1.0057 1.0038 0.9913 0.9911 0.9906
dispcorr: -0.030467673 hartree
energy: -1079.777228580001
dipole: 3.12061 -4.42893 -1.30832 -18.63629 17.56022 -1.07607 0.43465 -0.11382 0.32083
magnitude: 1.72411 au
magnitude: 4.38233 debye
