program: Orca
programVersion: 5.0.2
elementType: O O O C C C C C C C C C C C C C C C C C C C C C C H H H H H H H H H H H H H H H H H H H H H H H H H H
charge: 0
multiplicity: 1
keywords: wb97x-d3
keywords: def2-TZVPP
keywords: def2/J RIJCOSX
keywords: DEFGRID2
keywords: scfconv7
keywords: smallprint printgap noloewdin
keywords: NOSOSCF
formula: C22H26O3
InChI: InChI=1/C22H26O3/c1-15(2)10-19-20(22(19,3)4)21(23)25-14-17-12-18(24-13-17)11-16-8-6-5-7-9-16/h5-10,12-13,19-20H,11,14H2,1-4H3
51 atoms
O  1.921318 2.082643 0.286712
O  1.495648 0.599566 -1.3273
O  -2.436843 2.401285 -0.759839
C  2.096116 -1.403345 1.061077
C  3.331706 -1.366766 0.215492
C  2.682764 -0.059076 0.661075
C  0.784196 -1.881316 0.491134
C  2.263897 -1.767505 2.516911
C  3.364303 -1.830304 -1.184372
C  1.977731 0.860813 -0.25099
C  4.385227 -2.459589 -1.77859
C  4.278339 -2.893244 -3.210891
C  5.700161 -2.788939 -1.138128
C  1.141704 3.079037 -0.385196
C  -0.311997 2.793261 -0.260601
C  -1.033055 2.517564 0.946146
C  -1.21948 2.699869 -1.258408
C  -2.315396 2.280821 0.582806
C  -3.518277 1.859566 1.34179
C  -3.983273 0.466111 0.978547
C  -5.338652 0.18447 0.842176
C  -3.066006 -0.566381 0.796711
C  -5.76986 -1.100343 0.536184
C  -3.492181 -1.848953 0.486192
C  -4.847962 -2.121436 0.355305
H  4.245448 -1.551299 0.76916
H  3.206481 0.455206 1.458971
H  0.611886 -1.596708 -0.543134
H  0.736877 -2.97095 0.544452
H  -0.04522 -1.490503 1.08395
H  1.480014 -1.312821 3.126638
H  2.201552 -2.849559 2.651447
H  3.225832 -1.43954 2.913196
H  2.476888 -1.661158 -1.780888
H  4.370514 -3.979276 -3.301145
H  5.08585 -2.46606 -3.812299
H  3.331643 -2.597804 -3.663533
H  5.730155 -2.61993 -0.062421
H  6.50524 -2.198653 -1.587268
H  5.956413 -3.837926 -1.311418
H  1.438278 3.173432 -1.431786
H  1.405454 4.008667 0.119191
H  -0.640235 2.483301 1.950631
H  -1.143976 2.818205 -2.328431
H  -4.337054 2.56842 1.190166
H  -3.270088 1.902282 2.405194
H  -6.066197 0.977105 0.974069
H  -2.004959 -0.366684 0.893028
H  -6.828926 -1.300959 0.433693
H  -2.762124 -2.636394 0.344062
H  -5.182115 -3.121644 0.110667
elementType: O C H
totalener: -1079.75043223 hartree
nucrepener: 2137.75699429 hartree
electener: -3217.50742652 hartree
oneelecener: -5715.05374085 hartree
twoeener: 2497.54631434 hartree
cpcmener: -0.02682185 hartree
kineticenergy: 1074.85467532 hartree
xcener: -106.462911650574 hartree
chargesum: 0.0000000
charge: -0.287608 -0.463745 -0.277452 0.124788 0.036343 -0.094179 -0.316875 -0.262407 -0.291597 0.391639 -0.055356 -0.219197 -0.258412 0.097276 -0.057315 -0.337231 -0.036140 0.196976 -0.045281 -0.010736 -0.160928 -0.155093 -0.164370 -0.181033 -0.152730 0.115917 0.094916 0.102026 0.108448 0.095866 0.094440 0.094545 0.086103 0.117002 0.092465 0.091361 0.088537 0.088840 0.099435 0.092398 0.116213 0.117657 0.155736 0.173627 0.103702 0.106124 0.138634 0.139402 0.155691 0.154762 0.156813
qa: -0.2876 -0.4637 -0.2775 0.1248 0.0363 -0.0942 -0.3169 -0.2624 -0.2916 0.3916 -0.0554 -0.2192 -0.2584 0.0973 -0.0573 -0.3372 -0.0361 0.1970 -0.0453 -0.0107 -0.1609 -0.1551 -0.1644 -0.1810 -0.1527 0.1159 0.0949 0.1020 0.1084 0.0959 0.0944 0.0945 0.0861 0.1170 0.0925 0.0914 0.0885 0.0888 0.0994 0.0924 0.1162 0.1177 0.1557 0.1736 0.1037 0.1061 0.1386 0.1394 0.1557 0.1548 0.1568
va: 2.1138 2.0298 2.2761 3.7060 3.7323 3.8508 3.9040 3.9045 3.8523 4.1251 3.7827 3.9228 3.9387 3.8475 3.6178 3.9742 3.9611 3.6335 3.8350 3.7277 3.9064 3.8967 3.9070 3.9122 3.8968 1.0017 1.0301 1.0144 1.0014 0.9974 1.0025 1.0015 1.0059 1.0259 0.9965 0.9958 1.0092 1.0132 0.9957 0.9975 1.0065 0.9888 1.0124 0.9961 1.0090 1.0037 1.0027 0.9920 0.9912 0.9937 0.9909
dispcorr: -0.024117246 hartree
energy: -1079.774549474869
dipole: 18.46078 -18.00574 0.45504 -19.86349 19.95772 0.09423 1.01199 0.20021 1.21219
magnitude: 1.29821 au
magnitude: 3.29979 debye
