program: Orca
programVersion: 5.0.2
elementType: O O O C C C C C C C C C C C C C C C C C C C C C C H H H H H H H H H H H H H H H H H H H H H H H H H H
charge: 0
multiplicity: 1
keywords: wb97x-d3
keywords: def2-TZVPP
keywords: def2/J RIJCOSX
keywords: DEFGRID2
keywords: scfconv7
keywords: smallprint printgap noloewdin
keywords: NOSOSCF
formula: C22H26O3
InChI: InChI=1/C22H26O3/c1-15(2)10-19-20(22(19,3)4)21(23)25-14-17-12-18(24-13-17)11-16-8-6-5-7-9-16/h5-10,12-13,19-20H,11,14H2,1-4H3
51 atoms
O  1.719037 0.977368 -1.553363
O  2.755195 1.611232 0.320299
O  -1.402881 0.92624 1.49559
C  4.878364 -0.547755 -0.288882
C  3.739875 -1.319063 0.282223
C  3.498011 -0.331869 -0.87218
C  5.576792 0.518094 0.520026
C  5.82796 -1.300506 -1.192819
C  3.195941 -1.078553 1.639687
C  2.661111 0.850903 -0.613917
C  1.952242 -1.405948 2.000231
C  1.452581 -1.187247 3.393438
C  0.9740 -1.998887 1.024204
C  0.69009 1.95479 -1.328955
C  -0.330696 1.437155 -0.376528
C  -1.462645 0.618022 -0.692027
C  -0.349685 1.583361 0.9703
C  -2.079961 0.338659 0.480877
C  -3.283682 -0.465028 0.83689
C  -4.388258 -0.31578 -0.176845
C  -4.763405 -1.375316 -0.994135
C  -5.054341 0.901932 -0.308957
C  -5.786404 -1.226021 -1.924229
C  -6.075375 1.053814 -1.233443
C  -6.445424 -0.012323 -2.045709
H  3.659903 -2.350359 -0.054564
H  3.318417 -0.795312 -1.835533
H  4.937751 1.025258 1.236305
H  6.40138 0.067038 1.07626
H  6.005434 1.277416 -0.13699
H  6.317838 -0.625597 -1.897741
H  6.607903 -1.789745 -0.60535
H  5.318592 -2.072215 -1.771868
H  3.859369 -0.640218 2.378974
H  1.123602 -2.12652 3.846523
H  0.582377 -0.524481 3.392999
H  2.211366 -0.748467 4.041489
H  1.309669 -2.972067 0.656133
H  0.837454 -1.365206 0.145462
H  -0.006271 -2.147647 1.477207
H  0.248914 2.122921 -2.310234
H  1.119675 2.897473 -0.989169
H  -1.773509 0.292832 -1.673098
H  0.283683 2.114457 1.663008
H  -3.640963 -0.149976 1.820868
H  -3.013138 -1.52051 0.935349
H  -4.255171 -2.328232 -0.90332
H  -4.771728 1.737845 0.320986
H  -6.067491 -2.0617 -2.552629
H  -6.585535 2.004871 -1.320051
H  -7.243372 0.105309 -2.767773
elementType: O C H
totalener: -1079.74843769 hartree
nucrepener: 2160.10711276 hartree
electener: -3239.85555045 hartree
oneelecener: -5759.64977039 hartree
twoeener: 2519.79421994 hartree
cpcmener: -0.02392239 hartree
kineticenergy: 1074.85345514 hartree
xcener: -106.460666068048 hartree
chargesum: -0.0000000
charge: -0.290977 -0.464762 -0.277485 0.132593 -0.026334 -0.097133 -0.297321 -0.264797 -0.258354 0.378093 -0.008459 -0.217449 -0.293780 0.080011 -0.073080 -0.320397 -0.016225 0.186532 -0.012150 0.003295 -0.173838 -0.210734 -0.150655 -0.144748 -0.171612 0.110512 0.090858 0.094674 0.096960 0.099840 0.095464 0.094172 0.085435 0.121308 0.101601 0.088178 0.087053 0.116108 0.088143 0.099435 0.117384 0.118703 0.155418 0.168005 0.111607 0.094940 0.139356 0.143655 0.156582 0.156866 0.157508
qa: -0.2910 -0.4648 -0.2775 0.1326 -0.0263 -0.0971 -0.2973 -0.2648 -0.2584 0.3781 -0.0085 -0.2174 -0.2938 0.0800 -0.0731 -0.3204 -0.0162 0.1865 -0.0121 0.0033 -0.1738 -0.2107 -0.1507 -0.1447 -0.1716 0.1105 0.0909 0.0947 0.0970 0.0998 0.0955 0.0942 0.0854 0.1213 0.1016 0.0882 0.0871 0.1161 0.0881 0.0994 0.1174 0.1187 0.1554 0.1680 0.1116 0.0949 0.1394 0.1437 0.1566 0.1569 0.1575
va: 2.1019 2.0205 2.2600 3.7660 3.8103 3.8309 3.8894 3.8978 3.8106 4.1324 3.6652 3.9115 3.9563 3.8346 3.6096 3.9400 3.8983 3.6043 3.7761 3.6491 3.9149 3.9401 3.8972 3.8840 3.8985 1.0051 1.0329 1.0184 0.9989 1.0007 1.0027 1.0024 1.0049 1.0018 0.9942 1.0000 1.0088 1.0009 1.0036 1.0053 0.9938 1.0123 1.0084 1.0083 1.0096 1.0065 1.0039 1.0026 0.9911 0.9906 0.9905
dispcorr: -0.026711380 hartree
energy: -1079.775149072487
dipole: 15.85713 -16.32411 -0.46698 -10.28954 9.40715 -0.88238 4.09328 -4.77124 -0.67796
magnitude: 1.20677 au
magnitude: 3.06736 debye
