program: Orca
programVersion: 5.0.2
elementType: O O O C C C C C C C C C C C C C C C C C C C C C C H H H H H H H H H H H H H H H H H H H H H H H H H H
charge: 0
multiplicity: 1
keywords: wb97x-d3
keywords: def2-TZVPP
keywords: def2/J RIJCOSX
keywords: DEFGRID2
keywords: scfconv7
keywords: smallprint printgap noloewdin
keywords: NOSOSCF
formula: C22H26O3
InChI: InChI=1/C22H26O3/c1-15(2)10-19-20(22(19,3)4)21(23)25-14-17-12-18(24-13-17)11-16-8-6-5-7-9-16/h5-10,12-13,19-20H,11,14H2,1-4H3
51 atoms
O  2.410611 2.173528 -0.210247
O  1.639054 0.739528 1.313818
O  -1.655044 1.72862 -1.330813
C  3.97212 -1.126505 0.544623
C  3.000546 -1.317043 -0.569495
C  3.42836 0.100732 -0.152181
C  3.605304 -1.466401 1.96847
C  5.421796 -1.428081 0.239899
C  1.61643 -1.803475 -0.356546
C  2.410223 0.996026 0.42132
C  0.639855 -1.734119 -1.26576
C  -0.722019 -2.288124 -0.986312
C  0.811477 -1.112362 -2.619231
C  1.39469 3.112748 0.158257
C  0.030936 2.633496 -0.208774
C  -1.117849 2.571741 0.639816
C  -0.36123 2.112188 -1.394547
C  -2.112469 2.014952 -0.090572
C  -3.505285 1.619951 0.2404
C  -3.643839 0.130194 0.45891
C  -3.006168 -0.481427 1.536907
C  -4.3975 -0.655203 -0.405859
C  -3.128718 -1.845641 1.750171
C  -4.517882 -2.024816 -0.197649
C  -3.885741 -2.623723 0.881824
H  3.439554 -1.603352 -1.52078
H  4.107709 0.590657 -0.841001
H  4.181531 -0.855934 2.666621
H  2.555085 -1.331623 2.207919
H  3.859108 -2.509754 2.166434
H  6.085843 -0.875256 0.908077
H  5.628077 -2.492098 0.37445
H  5.690172 -1.167196 -0.784739
H  1.39425 -2.276265 0.595302
H  -1.021638 -3.008941 -1.751157
H  -1.4717 -1.493063 -1.002907
H  -0.773156 -2.782631 -0.017401
H  1.669292 -0.442509 -2.679996
H  -0.078754 -0.545246 -2.900056
H  0.938786 -1.882186 -3.387409
H  1.661661 4.021695 -0.378951
H  1.446315 3.335753 1.225551
H  -1.182818 2.890909 1.668725
H  0.14641 1.955952 -2.333683
H  -4.188728 1.943825 -0.548966
H  -3.797186 2.155681 1.145936
H  -2.407396 0.11566 2.215972
H  -4.898663 -0.194996 -1.249523
H  -2.628942 -2.304526 2.594015
H  -5.109297 -2.621592 -0.88094
H  -3.980169 -3.689637 1.046963
elementType: O C H
totalener: -1079.74850659 hartree
nucrepener: 2246.13050964 hartree
electener: -3325.87901624 hartree
oneelecener: -5932.58629079 hartree
twoeener: 2606.70727455 hartree
cpcmener: -0.02702170 hartree
kineticenergy: 1074.87541119 hartree
xcener: -106.467348254563 hartree
chargesum: -0.0000000
charge: -0.288660 -0.460773 -0.276477 0.148801 -0.038960 -0.096924 -0.300246 -0.263574 -0.241703 0.369964 -0.015634 -0.214484 -0.305608 0.098398 -0.027868 -0.331353 -0.074563 0.208602 -0.062597 0.015775 -0.158755 -0.171833 -0.190273 -0.154451 -0.157976 0.111306 0.091926 0.100084 0.092870 0.097755 0.094494 0.094285 0.085850 0.122583 0.103944 0.063739 0.094530 0.097465 0.091630 0.120241 0.117408 0.116268 0.159736 0.171022 0.105871 0.116591 0.139745 0.136979 0.154983 0.154450 0.155417
qa: -0.2887 -0.4608 -0.2765 0.1488 -0.0390 -0.0969 -0.3002 -0.2636 -0.2417 0.3700 -0.0156 -0.2145 -0.3056 0.0984 -0.0279 -0.3314 -0.0746 0.2086 -0.0626 0.0158 -0.1588 -0.1718 -0.1903 -0.1545 -0.1580 0.1113 0.0919 0.1001 0.0929 0.0978 0.0945 0.0943 0.0858 0.1226 0.1039 0.0637 0.0945 0.0975 0.0916 0.1202 0.1174 0.1163 0.1597 0.1710 0.1059 0.1166 0.1397 0.1370 0.1550 0.1545 0.1554
va: 2.1155 2.0265 2.2572 3.7566 3.8064 3.8326 3.8928 3.8947 3.8352 4.1494 3.6938 3.9265 3.9522 3.8325 3.6038 4.0100 3.9300 3.6128 3.8264 3.6189 3.8706 3.9112 3.8910 3.8826 3.8558 1.0030 1.0308 1.0002 1.0203 0.9990 1.0028 1.0023 1.0044 1.0022 0.9981 1.0010 1.0031 1.0005 0.9972 0.9975 0.9937 1.0054 1.0055 0.9949 1.0125 1.0057 1.0050 1.0042 0.9937 0.9920 0.9916
dispcorr: -0.028688888 hartree
energy: -1079.777195479204
dipole: 10.54518 -10.19241 0.35278 -14.32977 14.60515 0.27538 -1.52052 0.91147 -0.60905
magnitude: 0.75580 au
magnitude: 1.92108 debye
