program: Orca
programVersion: 5.0.2
elementType: O O O C C C C C C C C C C C C C C C C C C C C C C H H H H H H H H H H H H H H H H H H H H H H H H H H
charge: 0
multiplicity: 1
keywords: wb97x-d3
keywords: def2-TZVPP
keywords: def2/J RIJCOSX
keywords: DEFGRID2
keywords: scfconv7
keywords: smallprint printgap noloewdin
keywords: NOSOSCF
formula: C22H26O3
InChI: InChI=1/C22H26O3/c1-15(2)10-19-20(22(19,3)4)21(23)25-14-17-12-18(24-13-17)11-16-8-6-5-7-9-16/h5-10,12-13,19-20H,11,14H2,1-4H3
51 atoms
O  1.998134 1.580112 -1.225914
O  2.604891 1.372075 0.913437
O  -1.645864 0.345499 0.92299
C  5.041696 -0.244525 -0.106745
C  3.915743 -1.219566 -0.083686
C  3.746048 0.133497 -0.792981
C  5.505493 0.441173 1.154711
C  6.180138 -0.54511 -1.055366
C  3.151947 -1.544502 1.145904
C  2.76085 1.081116 -0.248577
C  1.910866 -2.038149 1.147601
C  1.197112 -2.3657 2.422287
C  1.132856 -2.295932 -0.107498
C  0.854325 2.357549 -0.839747
C  -0.250965 1.474577 -0.379341
C  -1.089411 0.647281 -1.195332
C  -0.636341 1.238366 0.896663
C  -1.916604 -0.016151 -0.354319
C  -3.013181 -0.996378 -0.573223
C  -4.386395 -0.372401 -0.485509
C  -4.936349 -0.022339 0.746016
C  -5.120422 -0.122359 -1.64082
C  -6.190535 0.567152 0.817715
C  -6.377741 0.463713 -1.571632
C  -6.916013 0.812587 -0.34118
H  3.997126 -2.036939 -0.795248
H  3.760881 0.088752 -1.875844
H  6.270634 -0.170111 1.638071
H  5.960823 1.405221 0.919572
H  4.719572 0.618421 1.882581
H  5.834211 -1.032081 -1.968419
H  6.701528 0.369978 -1.344085
H  6.909147 -1.207554 -0.583955
H  3.647452 -1.385731 2.098877
H  1.827302 -2.21828 3.299414
H  0.84587 -3.401271 2.427195
H  0.308136 -1.738374 2.535498
H  1.159903 -3.358507 -0.369202
H  1.507185 -1.737371 -0.965172
H  0.079689 -2.039814 0.026306
H  0.570896 2.89678 -1.742639
H  1.120168 3.094034 -0.080683
H  -1.072903 0.563703 -2.27115
H  -0.298423 1.619164 1.847848
H  -2.925819 -1.811374 0.151172
H  -2.873595 -1.439255 -1.560067
H  -4.3862 -0.217566 1.659094
H  -4.706963 -0.392667 -2.605662
H  -6.6051 0.831391 1.782452
H  -6.936581 0.645545 -2.481078
H  -7.896268 1.268392 -0.284469
elementType: O C H
totalener: -1079.75018635 hartree
nucrepener: 2155.08996915 hartree
electener: -3234.84015549 hartree
oneelecener: -5749.78011697 hartree
twoeener: 2514.93996148 hartree
cpcmener: -0.02545493 hartree
kineticenergy: 1074.86309259 hartree
xcener: -106.462017797994 hartree
chargesum: 0.0000000
charge: -0.290152 -0.463423 -0.280997 0.137546 -0.025073 -0.094183 -0.299051 -0.265070 -0.267262 0.370356 -0.004711 -0.217590 -0.290880 0.088878 -0.042300 -0.347025 -0.029444 0.211797 -0.069327 0.061992 -0.207087 -0.192100 -0.159176 -0.153368 -0.169702 0.112523 0.092326 0.097464 0.099689 0.094989 0.086239 0.095291 0.094564 0.119863 0.088611 0.098193 0.086837 0.120818 0.096267 0.085828 0.119203 0.115235 0.154350 0.166621 0.119764 0.105200 0.139328 0.138301 0.156088 0.156335 0.157422
qa: -0.2902 -0.4634 -0.2810 0.1375 -0.0251 -0.0942 -0.2991 -0.2651 -0.2673 0.3704 -0.0047 -0.2176 -0.2909 0.0889 -0.0423 -0.3470 -0.0294 0.2118 -0.0693 0.0620 -0.2071 -0.1921 -0.1592 -0.1534 -0.1697 0.1125 0.0923 0.0975 0.0997 0.0950 0.0862 0.0953 0.0946 0.1199 0.0886 0.0982 0.0868 0.1208 0.0963 0.0858 0.1192 0.1152 0.1544 0.1666 0.1198 0.1052 0.1393 0.1383 0.1561 0.1563 0.1574
va: 2.1067 2.0235 2.2536 3.7513 3.8075 3.8269 3.8900 3.8968 3.8518 4.1463 3.6793 3.9229 3.9529 3.8426 3.5707 3.9859 3.9264 3.5550 3.7947 3.5935 3.9604 3.9421 3.9065 3.8961 3.9011 1.0036 1.0308 0.9984 1.0004 1.0181 1.0042 1.0026 1.0024 1.0029 1.0085 0.9954 1.0011 0.9986 1.0049 0.9984 0.9916 1.0120 1.0115 1.0044 1.0047 1.0103 1.0150 1.0049 0.9916 0.9912 0.9905
dispcorr: -0.026295338 hartree
energy: -1079.776481687914
dipole: 16.50331 -16.63666 -0.13335 -10.86898 10.31256 -0.55642 1.71696 -2.83678 -1.11982
magnitude: 1.25753 au
magnitude: 3.19640 debye
