program: Orca
programVersion: 5.0.2
elementType: O O O C C C C C C C C C C C C C C C C C C C C C C H H H H H H H H H H H H H H H H H H H H H H H H H H
charge: 0
multiplicity: 1
keywords: wb97x-d3
keywords: def2-TZVPP
keywords: def2/J RIJCOSX
keywords: DEFGRID2
keywords: scfconv7
keywords: smallprint printgap noloewdin
keywords: NOSOSCF
formula: C22H26O3
InChI: InChI=1/C22H26O3/c1-15(2)10-19-20(22(19,3)4)21(23)25-14-17-12-18(24-13-17)11-16-8-6-5-7-9-16/h5-10,12-13,19-20H,11,14H2,1-4H3
51 atoms
O  2.063205 1.735544 -0.997705
O  2.621824 1.1824 1.096562
O  -2.334304 2.330398 -0.505528
C  4.546048 -0.883656 -0.222634
C  3.237358 -1.57537 -0.077783
C  3.300864 -0.193705 -0.746719
C  5.286283 -0.362204 0.984034
C  5.473673 -1.391778 -1.302222
C  2.565948 -1.783628 1.225793
C  2.656256 0.954016 -0.089996
C  1.260219 -2.040508 1.339176
C  0.617125 -2.290508 2.667262
C  0.356772 -2.078948 0.137411
C  1.283454 2.848429 -0.539783
C  -0.127957 2.448771 -0.291479
C  -0.644703 1.519946 0.672348
C  -1.206097 2.897501 -0.975626
C  -1.985655 1.484502 0.491945
C  -3.071431 0.710711 1.142573
C  -3.884665 -0.122807 0.178699
C  -3.273068 -0.839074 -0.848419
C  -5.266042 -0.209197 0.320104
C  -4.025387 -1.625798 -1.708406
C  -6.021809 -0.997524 -0.538191
C  -5.403598 -1.707651 -1.557277
H  3.042373 -2.35773 -0.807616
H  3.188968 -0.198965 -1.824594
H  5.940099 0.465245 0.701574
H  4.64195 -0.012503 1.785365
H  5.91953 -1.152594 1.39253
H  6.133149 -0.598313 -1.659467
H  6.1020 -2.19902 -0.919745
H  4.924921 -1.78013 -2.161445
H  3.177215 -1.752244 2.122285
H  0.121422 -3.264857 2.688645
H  -0.159168 -1.547277 2.870949
H  1.335263 -2.259706 3.486873
H  0.610116 -2.905169 -0.532205
H  0.428355 -1.163868 -0.4551
H  -0.687362 -2.205776 0.423804
H  1.326821 3.58139 -1.344747
H  1.739233 3.298376 0.343098
H  -0.091227 0.949708 1.401351
H  -1.312793 3.600228 -1.787925
H  -3.739532 1.382163 1.690099
H  -2.609406 0.06508 1.894044
H  -2.198659 -0.783673 -0.982018
H  -5.758528 0.346755 1.109607
H  -3.533132 -2.17459 -2.501435
H  -7.095931 -1.050854 -0.412637
H  -5.990661 -2.318904 -2.230818
elementType: O C H
totalener: -1079.74928519 hartree
nucrepener: 2175.99786013 hartree
electener: -3255.74714532 hartree
oneelecener: -5791.24208142 hartree
twoeener: 2535.49493610 hartree
cpcmener: -0.02535778 hartree
kineticenergy: 1074.85881641 hartree
xcener: -106.463008798847 hartree
chargesum: 0.0000000
charge: -0.290692 -0.470905 -0.281711 0.129927 -0.029946 -0.099483 -0.296827 -0.263470 -0.245552 0.398418 -0.021785 -0.214913 -0.308221 0.073940 -0.053625 -0.351479 -0.042409 0.230817 -0.067553 0.071940 -0.240372 -0.176276 -0.165385 -0.151087 -0.171518 0.111904 0.090826 0.099053 0.094699 0.099538 0.096072 0.094039 0.085979 0.121426 0.102392 0.088416 0.087361 0.117104 0.093914 0.104748 0.114733 0.115714 0.168709 0.173209 0.107994 0.112655 0.152825 0.138263 0.154821 0.156073 0.155695
qa: -0.2907 -0.4709 -0.2817 0.1299 -0.0299 -0.0995 -0.2968 -0.2635 -0.2456 0.3984 -0.0218 -0.2149 -0.3082 0.0739 -0.0536 -0.3515 -0.0424 0.2308 -0.0676 0.0719 -0.2404 -0.1763 -0.1654 -0.1511 -0.1715 0.1119 0.0908 0.0991 0.0947 0.0995 0.0961 0.0940 0.0860 0.1214 0.1024 0.0884 0.0874 0.1171 0.0939 0.1047 0.1147 0.1157 0.1687 0.1732 0.1080 0.1127 0.1528 0.1383 0.1548 0.1561 0.1557
va: 2.1057 2.0127 2.2791 3.7674 3.8062 3.8514 3.8936 3.8961 3.8042 4.0894 3.6736 3.9148 3.9615 3.8643 3.6789 3.9837 3.9737 3.6026 3.8338 3.5725 3.9414 3.9383 3.9329 3.8928 3.9064 1.0027 1.0333 1.0006 1.0184 0.9981 1.0025 1.0022 1.0050 1.0011 0.9941 0.9940 1.0093 1.0009 0.9955 0.9989 0.9975 1.0098 1.0123 0.9955 1.0080 1.0025 0.9936 1.0031 0.9927 0.9910 0.9909
dispcorr: -0.026706255 hartree
energy: -1079.775991446203
dipole: 14.44597 -14.50614 -0.06017 -15.32072 14.91416 -0.40656 3.95054 -4.60223 -0.65169
magnitude: 0.77046 au
magnitude: 1.95837 debye
