program: Orca
programVersion: 5.0.2
elementType: O O O C C C C C C C C C C C C C C C C C C C C C C H H H H H H H H H H H H H H H H H H H H H H H H H H
charge: 0
multiplicity: 1
keywords: wb97x-d3
keywords: def2-TZVPP
keywords: def2/J RIJCOSX
keywords: DEFGRID2
keywords: scfconv7
keywords: smallprint printgap noloewdin
keywords: NOSOSCF
formula: C22H26O3
InChI: InChI=1/C22H26O3/c1-15(2)10-19-20(22(19,3)4)21(23)25-14-17-12-18(24-13-17)11-16-8-6-5-7-9-16/h5-10,12-13,19-20H,11,14H2,1-4H3
51 atoms
O  2.085091 2.313211 -0.764149
O  2.182342 1.102249 1.112262
O  -1.903151 2.343584 1.140429
C  3.657528 -1.044796 -0.560149
C  2.21784 -1.270827 -0.907714
C  2.809245 0.129629 -0.993021
C  4.122182 -1.201586 0.866247
C  4.688526 -1.491941 -1.570759
C  1.187412 -1.633485 0.100768
C  2.343382 1.191909 -0.075439
C  1.005245 -2.870304 0.566411
C  -0.064046 -3.173872 1.571869
C  1.843831 -4.040418 0.15016
C  1.401968 3.35392 -0.061682
C  -0.020468 2.984238 0.159838
C  -1.000918 2.705236 -0.844768
C  -0.634108 2.73822 1.339215
C  -2.1200 2.314392 -0.191605
C  -3.423771 1.782692 -0.660778
C  -3.572986 0.305535 -0.36972
C  -4.680556 -0.180882 0.311518
C  -2.59341 -0.59347 -0.782407
C  -4.812148 -1.5379 0.574241
C  -2.720191 -1.947421 -0.521728
C  -3.832456 -2.424996 0.158639
H  2.048954 -1.706716 -1.889898
H  2.988685 0.486732 -2.000547
H  3.355918 -0.964315 1.59654
H  4.434944 -2.234909 1.03076
H  4.98469 -0.562116 1.061445
H  4.944704 -2.542734 -1.419738
H  4.333669 -1.382855 -2.596696
H  5.607778 -0.911296 -1.474715
H  0.532756 -0.849103 0.464261
H  -0.665419 -2.297699 1.808661
H  0.373478 -3.547394 2.501411
H  -0.739381 -3.954888 1.212362
H  2.32351 -4.49997 1.017981
H  2.625587 -3.773435 -0.558697
H  1.226779 -4.81783 -0.308478
H  1.489201 4.225374 -0.710507
H  1.899256 3.58389 0.882466
H  -0.875802 2.769395 -1.914001
H  -0.289074 2.782994 2.359158
H  -3.489719 1.959682 -1.737074
H  -4.251922 2.334148 -0.207416
H  -5.447397 0.507092 0.647372
H  -1.713593 -0.229345 -1.300048
H  -5.679946 -1.899267 1.110533
H  -1.941161 -2.626989 -0.841919
H  -3.930323 -3.482082 0.368327
totalener: -1079.72730455 hartree
nucrepener: 2214.72097367 hartree
electener: -3294.44827822 hartree
oneelecener: -5868.03057724 hartree
twoeener: 2573.58229902 hartree
kineticenergy: 1074.91766599 hartree
xcener: -106.468995594156 hartree
chargesum: -0.0000000
charge: -0.269808 -0.379400 -0.246060 0.087047 -0.040656 -0.057510 -0.257995 -0.244282 -0.177870 0.314022 -0.046632 -0.232574 -0.251968 0.070937 -0.053123 -0.314246 0.003102 0.220545 -0.107119 0.066276 -0.151094 -0.164253 -0.119199 -0.150120 -0.120335 0.097636 0.081518 0.113915 0.077241 0.091905 0.082945 0.073011 0.093185 0.105466 0.096143 0.099833 0.075863 0.090579 0.078202 0.095093 0.104919 0.102658 0.128177 0.137930 0.103103 0.090338 0.104368 0.122377 0.122656 0.131994 0.121262
qa: -0.2698 -0.3794 -0.2461 0.0870 -0.0407 -0.0575 -0.2580 -0.2443 -0.1779 0.3140 -0.0466 -0.2326 -0.2520 0.0709 -0.0531 -0.3142 0.0031 0.2205 -0.1071 0.0663 -0.1511 -0.1643 -0.1192 -0.1501 -0.1203 0.0976 0.0815 0.1139 0.0772 0.0919 0.0829 0.0730 0.0932 0.1055 0.0961 0.0998 0.0759 0.0906 0.0782 0.0951 0.1049 0.1027 0.1282 0.1379 0.1031 0.0903 0.1044 0.1224 0.1227 0.1320 0.1213
va: 2.1172 2.1068 2.3086 3.7185 3.8596 3.8632 3.9049 3.9017 3.8689 4.2017 3.7210 3.9482 3.9365 3.8995 3.6697 4.0221 3.9850 3.6113 3.8887 3.6743 3.9985 3.9552 3.9708 3.9454 3.9450 1.0034 1.0301 1.0175 0.9998 1.0054 1.0062 1.0072 1.0052 1.0050 1.0018 1.0028 0.9966 0.9989 1.0096 1.0033 0.9894 1.0100 1.0190 1.0114 1.0034 1.0134 1.0112 1.0077 1.0004 0.9934 1.0020
dispcorr: -0.027536320 hartree
energy: -1079.754840866593
dipole: 13.18639 -13.18445 0.00194 -21.89801 21.75200 -0.14601 -0.96530 0.36536 -0.59995
magnitude: 0.61746 au
magnitude: 1.56946 debye
