program: Orca
programVersion: 5.0.2
elementType: O O O C C C C C C C C C C C C C C C C C C C C C C H H H H H H H H H H H H H H H H H H H H H H H H H H
charge: 0
multiplicity: 1
keywords: wb97x-d3
keywords: def2-TZVPP
keywords: def2/J RIJCOSX
keywords: DEFGRID2
keywords: scfconv7
keywords: smallprint printgap noloewdin
keywords: NOSOSCF
formula: C22H26O3
InChI: InChI=1/C22H26O3/c1-15(2)10-19-20(22(19,3)4)21(23)25-14-17-12-18(24-13-17)11-16-8-6-5-7-9-16/h5-10,12-13,19-20H,11,14H2,1-4H3
51 atoms
O  2.158034 1.991155 -0.025123
O  2.224971 0.29876 1.434696
O  -2.157537 1.505762 -1.063197
C  4.956977 -0.449907 0.223681
C  3.971974 -0.993659 -0.753485
C  3.873191 0.466959 -0.298271
C  4.977282 -0.927722 1.655139
C  6.340644 -0.147692 -0.306958
C  2.928352 -1.981629 -0.386514
C  2.690405 0.875751 0.486867
C  1.784947 -2.147177 -1.052191
C  0.777722 -3.172178 -0.63064
C  1.393613 -1.31772 -2.236246
C  0.960597 2.488084 0.578328
C  -0.260606 1.823678 0.047595
C  -0.738793 0.497735 0.305178
C  -1.169814 2.375401 -0.790305
C  -1.888845 0.363275 -0.395396
C  -2.867527 -0.747565 -0.521655
C  -4.191149 -0.432553 0.133031
C  -5.301559 -0.08895 -0.626774
C  -4.310247 -0.462857 1.519018
C  -6.511479 0.211607 -0.016712
C  -5.516464 -0.166162 2.131912
C  -6.622672 0.171805 1.364211
H  4.33797 -1.085808 -1.772806
H  4.188195 1.202945 -1.029061
H  5.420875 -0.16783 2.30062
H  3.994641 -1.158663 2.052632
H  5.598114 -1.822791 1.729529
H  6.823731 0.632654 0.283716
H  6.971223 -1.03762 -0.263526
H  6.31766 0.188809 -1.344591
H  3.120631 -2.609646 0.476746
H  0.574887 -3.884283 -1.434456
H  -0.177125 -2.697167 -0.388341
H  1.102926 -3.734258 0.243659
H  1.18748 -1.949022 -3.103914
H  2.153105 -0.593061 -2.52051
H  0.476668 -0.762827 -2.022696
H  0.944154 3.550584 0.335965
H  1.015863 2.390559 1.66371
H  -0.27359 -0.246598 0.929865
H  -1.238179 3.347432 -1.25234
H  -2.424461 -1.633751 -0.062145
H  -3.024073 -0.993579 -1.575878
H  -5.221202 -0.05522 -1.706745
H  -3.447736 -0.71833 2.12364
H  -7.367741 0.477829 -0.622663
H  -5.594583 -0.199461 3.210909
H  -7.565721 0.403105 1.84166
totalener: -1079.72892351 hartree
nucrepener: 2156.00323441 hartree
electener: -3235.73215792 hartree
oneelecener: -5750.45018694 hartree
twoeener: 2514.71802901 hartree
kineticenergy: 1074.91721853 hartree
xcener: -106.469399264178 hartree
chargesum: 0.0000000
charge: -0.263573 -0.400423 -0.255702 0.140783 -0.059399 -0.112827 -0.279727 -0.244009 -0.163329 0.373963 -0.020149 -0.197589 -0.250685 0.056150 -0.033133 -0.351469 -0.037353 0.269790 -0.130245 0.079823 -0.153447 -0.165198 -0.126377 -0.129204 -0.128848 0.091290 0.080991 0.084809 0.104018 0.087274 0.090153 0.088011 0.070071 0.083271 0.089846 0.056467 0.083606 0.096116 0.083880 0.092616 0.093094 0.112148 0.155682 0.134173 0.111107 0.102951 0.105201 0.113547 0.122763 0.124386 0.124706
qa: -0.2636 -0.4004 -0.2557 0.1408 -0.0594 -0.1128 -0.2797 -0.2440 -0.1633 0.3740 -0.0201 -0.1976 -0.2507 0.0562 -0.0331 -0.3515 -0.0374 0.2698 -0.1302 0.0798 -0.1534 -0.1652 -0.1264 -0.1292 -0.1288 0.0913 0.0810 0.0848 0.1040 0.0873 0.0902 0.0880 0.0701 0.0833 0.0898 0.0565 0.0836 0.0961 0.0839 0.0926 0.0931 0.1121 0.1557 0.1342 0.1111 0.1030 0.1052 0.1135 0.1228 0.1244 0.1247
va: 2.1213 2.0797 2.3133 3.7389 3.8918 3.8504 3.9059 3.9037 3.8771 4.1303 3.7521 3.9382 3.9512 3.9165 3.7116 4.0111 4.0097 3.5277 3.8641 3.6356 4.0133 3.9970 3.9632 3.9723 3.9564 1.0054 1.0316 1.0051 1.0217 0.9977 1.0051 1.0048 1.0072 1.0139 1.0016 1.0054 1.0119 1.0020 1.0109 0.9963 0.9969 1.0066 1.0200 1.0078 1.0095 1.0077 1.0130 1.0103 1.0010 1.0007 0.9998
dispcorr: -0.026194664 hartree
energy: -1079.755118174607
dipole: 17.04357 -16.91448 0.12909 -12.45162 12.59551 0.14389 -2.41808 1.98138 -0.43670
magnitude: 0.47757 au
magnitude: 1.21389 debye
