program: Orca
programVersion: 5.0.2
elementType: O O O C C C C C C C C C C C C C C C C C C C C C C H H H H H H H H H H H H H H H H H H H H H H H H H H
charge: 0
multiplicity: 1
keywords: wb97x-d3
keywords: def2-TZVPP
keywords: def2/J RIJCOSX
keywords: DEFGRID2
keywords: scfconv7
keywords: smallprint printgap noloewdin
keywords: NOSOSCF
formula: C22H26O3
InChI: InChI=1/C22H26O3/c1-15(2)10-19-20(22(19,3)4)21(23)25-14-17-12-18(24-13-17)11-16-8-6-5-7-9-16/h5-10,12-13,19-20H,11,14H2,1-4H3
51 atoms
O  2.205457 2.058921 -0.00724
O  1.581519 0.325892 1.259615
O  -1.785452 2.490587 -1.839519
C  4.318369 -0.935405 0.515484
C  3.43273 -1.276373 -0.633542
C  3.523613 0.170544 -0.146022
C  3.986898 -1.413589 1.907749
C  5.805601 -0.894395 0.247609
C  2.197254 -2.081394 -0.473027
C  2.341511 0.813159 0.465714
C  1.092501 -1.939842 -1.20435
C  -0.114182 -2.792312 -0.962055
C  0.935879 -0.906963 -2.277422
C  1.067881 2.806702 0.425292
C  -0.173769 2.446318 -0.314178
C  -1.135562 1.430035 -0.006089
C  -0.629329 3.04638 -1.438854
C  -2.092028 1.507521 -0.961619
C  -3.348279 0.751234 -1.223634
C  -3.745944 -0.117254 -0.061037
C  -3.710363 -1.502223 -0.156876
C  -4.160656 0.458449 1.137244
C  -4.074548 -2.299904 0.919705
C  -4.527419 -0.333078 2.212751
C  -4.48393 -1.717026 2.107768
H  3.945639 -1.42319 -1.581368
H  4.094051 0.837108 -0.782644
H  2.921122 -1.467942 2.105907
H  4.415557 -2.405733 2.064369
H  4.426413 -0.746889 2.651689
H  6.241351 -1.890341 0.347719
H  6.031115 -0.536503 -0.757974
H  6.312987 -0.236277 0.955212
H  2.210851 -2.845763 0.297212
H  -0.445543 -3.285581 -1.879573
H  -0.947921 -2.178826 -0.610648
H  0.069932 -3.561379 -0.21306
H  1.831796 -0.309241 -2.431649
H  0.12081 -0.222425 -2.02854
H  0.676768 -1.374584 -3.230735
H  1.333788 3.845084 0.228126
H  0.922706 2.695234 1.501013
H  -1.103768 0.739571 0.820016
H  -0.248544 3.860551 -2.035075
H  -3.23218 0.136017 -2.121942
H  -4.152871 1.458941 -1.449843
H  -3.394654 -1.966049 -1.084055
H  -4.191061 1.537774 1.228179
H  -4.038048 -3.377353 0.826441
H  -4.849212 0.130549 3.136222
H  -4.770716 -2.335397 2.948047
totalener: -1079.72851273 hartree
nucrepener: 2209.19754329 hartree
electener: -3288.92605603 hartree
oneelecener: -5857.05674626 hartree
twoeener: 2568.13069024 hartree
kineticenergy: 1074.91156339 hartree
xcener: -106.469496726796 hartree
chargesum: 0.0000000
charge: -0.263615 -0.389011 -0.258436 0.133279 -0.052653 -0.115179 -0.281998 -0.244437 -0.184814 0.360819 0.014128 -0.195138 -0.254038 0.047056 -0.069935 -0.261514 -0.026896 0.192173 -0.073271 0.064417 -0.201254 -0.189649 -0.106659 -0.102576 -0.134106 0.094746 0.082853 0.109234 0.085753 0.084317 0.087280 0.070451 0.089152 0.082283 0.081149 0.066482 0.077773 0.087265 0.083703 0.097530 0.098389 0.109356 0.156926 0.136471 0.089346 0.107422 0.124062 0.116752 0.124574 0.125013 0.125026
qa: -0.2636 -0.3890 -0.2584 0.1333 -0.0527 -0.1152 -0.2820 -0.2444 -0.1848 0.3608 0.0141 -0.1951 -0.2540 0.0471 -0.0699 -0.2615 -0.0269 0.1922 -0.0733 0.0644 -0.2013 -0.1896 -0.1067 -0.1026 -0.1341 0.0947 0.0829 0.1092 0.0858 0.0843 0.0873 0.0705 0.0892 0.0823 0.0811 0.0665 0.0778 0.0873 0.0837 0.0975 0.0984 0.1094 0.1569 0.1365 0.0893 0.1074 0.1241 0.1168 0.1246 0.1250 0.1250
va: 2.1164 2.0938 2.2968 3.7302 3.9021 3.8215 3.9082 3.9043 3.9082 4.1379 3.7270 3.9346 3.9588 3.9272 3.6817 3.9203 3.9876 3.6016 3.8393 3.6037 3.9723 4.0028 3.9640 3.9383 3.9740 1.0046 1.0316 1.0191 0.9977 1.0054 1.0044 1.0074 1.0051 1.0123 0.9996 1.0047 1.0165 1.0112 0.9949 1.0032 0.9960 1.0063 1.0172 1.0079 1.0102 1.0053 1.0018 1.0090 1.0010 0.9996 0.9999
dispcorr: -0.027594683 hartree
energy: -1079.756107416706
dipole: 13.01902 -12.93255 0.08647 -14.32898 14.49345 0.16447 -0.34963 0.08117 -0.26846
magnitude: 0.32649 au
magnitude: 0.82988 debye
