program: Orca
programVersion: 5.0.2
elementType: O O O C C C C C C C C C C C C C C C C C C C C C C H H H H H H H H H H H H H H H H H H H H H H H H H H
charge: 0
multiplicity: 1
keywords: wb97x-d3
keywords: def2-TZVPP
keywords: def2/J RIJCOSX
keywords: DEFGRID2
keywords: scfconv7
keywords: smallprint printgap noloewdin
keywords: NOSOSCF
formula: C22H26O3
InChI: InChI=1/C22H26O3/c1-15(2)10-19-20(22(19,3)4)21(23)25-14-17-12-18(24-13-17)11-16-8-6-5-7-9-16/h5-10,12-13,19-20H,11,14H2,1-4H3
51 atoms
O  1.608908 0.969849 -1.481189
O  2.700764 1.48512 0.39933
O  -1.403432 1.350905 1.701859
C  4.770851 -0.654836 -0.374335
C  3.637236 -1.459698 0.164236
C  3.380953 -0.403066 -0.913583
C  5.479978 0.357114 0.49278
C  5.706574 -1.349836 -1.337461
C  3.121064 -1.291522 1.545378
C  2.567899 0.780692 -0.566578
C  1.861343 -1.520679 1.916423
C  1.419773 -1.330691 3.334951
C  0.786199 -1.945565 0.964319
C  0.685469 2.032184 -1.229714
C  -0.346359 1.656182 -0.223798
C  -1.600761 1.014098 -0.474585
C  -0.288216 1.827978 1.118141
C  -2.200784 0.85678 0.728585
C  -3.504369 0.271231 1.147686
C  -4.355192 -0.076444 -0.043037
C  -4.436912 -1.382666 -0.508705
C  -5.052808 0.919746 -0.719261
C  -5.202838 -1.691424 -1.624374
C  -5.817539 0.616694 -1.834184
C  -5.894339 -0.691928 -2.290567
H  3.564958 -2.473072 -0.223429
H  3.180991 -0.79316 -1.905104
H  5.911309 1.147935 -0.122798
H  4.835943 0.83048 1.226056
H  6.301129 -0.131524 1.021271
H  6.484555 -1.889673 -0.794567
H  5.185145 -2.070996 -1.968287
H  6.197525 -0.629718 -1.994277
H  3.8306 -0.965597 2.298886
H  0.625185 -0.582239 3.392823
H  2.236445 -1.004543 3.97771
H  1.01039 -2.254616 3.75121
H  1.151973 -2.12224 -0.044861
H  0.007215 -1.181563 0.898824
H  0.300211 -2.860712 1.312226
H  0.21841 2.225821 -2.194718
H  1.217619 2.934646 -0.926093
H  -2.001835 0.717589 -1.430405
H  0.465331 2.24466 1.765094
H  -4.034375 0.980134 1.791666
H  -3.335101 -0.620614 1.759473
H  -3.895763 -2.167964 0.005591
H  -4.991068 1.943727 -0.370065
H  -5.258297 -2.714478 -1.972563
H  -6.35738 1.40236 -2.34632
H  -6.492996 -0.930687 -3.159625
totalener: -1079.72937086 hartree
nucrepener: 2167.24945784 hartree
electener: -3246.97882869 hartree
oneelecener: -5773.00718729 hartree
twoeener: 2526.02835860 hartree
kineticenergy: 1074.91615655 hartree
xcener: -106.469909195764 hartree
chargesum: 0.0000000
charge: -0.265893 -0.397265 -0.259705 0.137095 -0.054707 -0.112036 -0.277107 -0.244891 -0.181176 0.360742 -0.004087 -0.207323 -0.229257 0.052842 -0.085745 -0.224756 0.003685 0.147038 -0.056649 0.022180 -0.144504 -0.165966 -0.126402 -0.120121 -0.127437 0.091529 0.081774 0.085666 0.104690 0.084912 0.087535 0.070374 0.089512 0.082379 0.081950 0.078168 0.083356 0.086072 0.069382 0.095103 0.100249 0.113561 0.136139 0.151986 0.101387 0.087507 0.107857 0.114181 0.124718 0.125370 0.126087
qa: -0.2659 -0.3973 -0.2597 0.1371 -0.0547 -0.1120 -0.2771 -0.2449 -0.1812 0.3607 -0.0041 -0.2073 -0.2293 0.0528 -0.0857 -0.2248 0.0037 0.1470 -0.0566 0.0222 -0.1445 -0.1660 -0.1264 -0.1201 -0.1274 0.0915 0.0818 0.0857 0.1047 0.0849 0.0875 0.0704 0.0895 0.0824 0.0819 0.0782 0.0834 0.0861 0.0694 0.0951 0.1002 0.1136 0.1361 0.1520 0.1014 0.0875 0.1079 0.1142 0.1247 0.1254 0.1261
va: 2.1220 2.0840 2.2837 3.7379 3.8945 3.8311 3.9070 3.9049 3.8931 4.1572 3.7491 3.9382 3.9522 3.8843 3.6610 3.9678 3.9275 3.6733 3.8552 3.6690 3.9780 3.9822 3.9668 3.9536 3.9535 1.0063 1.0315 1.0053 1.0203 0.9978 1.0048 1.0072 1.0052 1.0126 1.0036 1.0110 0.9993 1.0111 1.0035 1.0036 0.9940 1.0087 1.0098 1.0167 1.0062 1.0094 1.0118 1.0099 1.0006 1.0002 0.9996
dispcorr: -0.026433830 hartree
energy: -1079.755804688482
dipole: 15.42340 -15.83357 -0.41018 -10.82461 10.44030 -0.38431 3.16729 -3.67218 -0.50489
magnitude: 0.75555 au
magnitude: 1.92044 debye
