program: Orca
programVersion: 5.0.2
elementType: O O O C C C C C C C C C C C C C C C C C C C C C C H H H H H H H H H H H H H H H H H H H H H H H H H H
charge: 0
multiplicity: 1
keywords: wb97x-d3
keywords: def2-TZVPP
keywords: def2/J RIJCOSX
keywords: DEFGRID2
keywords: scfconv7
keywords: smallprint printgap noloewdin
keywords: NOSOSCF
formula: C22H26O3
InChI: InChI=1/C22H26O3/c1-15(2)10-19-20(22(19,3)4)21(23)25-14-17-12-18(24-13-17)11-16-8-6-5-7-9-16/h5-10,12-13,19-20H,11,14H2,1-4H3
51 atoms
O  1.629859 1.067208 -1.451701
O  2.740819 1.527926 0.43105
O  -1.332407 1.262176 1.781521
C  4.784124 -0.613192 -0.385422
C  3.627466 -1.431373 0.081353
C  3.413172 -0.316385 -0.946879
C  5.485622 0.341904 0.549555
C  5.735117 -1.271762 -1.359647
C  3.068555 -1.330127 1.452456
C  2.599981 0.853565 -0.555063
C  1.800173 -1.588644 1.772832
C  1.311345 -1.47369 3.183978
C  0.759628 -1.9808 0.769701
C  0.69719 2.108289 -1.149017
C  -0.317014 1.681542 -0.145041
C  -1.582741 1.066012 -0.406246
C  -0.227122 1.767912 1.203535
C  -2.156763 0.836777 0.798056
C  -3.456019 0.237348 1.210574
C  -4.317391 -0.077474 0.018193
C  -4.377009 -1.364756 -0.501103
C  -5.047911 0.929576 -0.604781
C  -5.154386 -1.644679 -1.616169
C  -5.824923 0.655047 -1.718956
C  -5.879868 -0.634667 -2.22847
H  3.556887 -2.421957 -0.361198
H  3.232255 -0.652566 -1.961584
H  4.830986 0.790109 1.289149
H  6.284873 -0.186698 1.07316
H  5.945512 1.154821 -0.01458
H  6.249878 -0.525949 -1.967676
H  6.493318 -1.847568 -0.825919
H  5.220705 -1.954158 -2.037577
H  3.750744 -1.03349 2.242323
H  0.898994 -2.421655 3.539102
H  0.506903 -0.737112 3.253916
H  2.103301 -1.173784 3.869113
H  1.149381 -2.063911 -0.242539
H  -0.049168 -1.246182 0.747171
H  0.306137 -2.939215 1.03639
H  0.215122 2.332024 -2.099937
H  1.222745 3.005256 -0.818707
H  -2.009027 0.832291 -1.36855
H  0.544305 2.136768 1.858317
H  -3.982101 0.925654 1.879731
H  -3.279918 -0.671639 1.794493
H  -3.809151 -2.157613 -0.028989
H  -5.004645 1.939047 -0.213292
H  -5.193112 -2.653409 -2.005857
H  -6.39088 1.448516 -2.189205
H  -6.488507 -0.851129 -3.096441
totalener: -1079.72936093 hartree
nucrepener: 2172.29752624 hartree
electener: -3252.02688717 hartree
oneelecener: -5783.08347257 hartree
twoeener: 2531.05658540 hartree
kineticenergy: 1074.91360931 hartree
xcener: -106.469661721604 hartree
chargesum: -0.0000000
charge: -0.265348 -0.398628 -0.260254 0.139528 -0.057662 -0.111873 -0.275307 -0.246001 -0.180886 0.362416 -0.003597 -0.208759 -0.230317 0.053226 -0.081141 -0.225283 0.000525 0.144424 -0.055662 0.025192 -0.146959 -0.166137 -0.126359 -0.121006 -0.127395 0.091450 0.081815 0.103347 0.085136 0.085376 0.089535 0.087949 0.070430 0.083203 0.084389 0.081266 0.078199 0.086183 0.067454 0.096359 0.099771 0.114367 0.136479 0.152813 0.100804 0.088483 0.107844 0.113957 0.124846 0.125650 0.126156
qa: -0.2653 -0.3986 -0.2603 0.1395 -0.0577 -0.1119 -0.2753 -0.2460 -0.1809 0.3624 -0.0036 -0.2088 -0.2303 0.0532 -0.0811 -0.2253 0.0005 0.1444 -0.0557 0.0252 -0.1470 -0.1661 -0.1264 -0.1210 -0.1274 0.0914 0.0818 0.1033 0.0851 0.0854 0.0895 0.0879 0.0704 0.0832 0.0844 0.0813 0.0782 0.0862 0.0675 0.0964 0.0998 0.1144 0.1365 0.1528 0.1008 0.0885 0.1078 0.1140 0.1248 0.1257 0.1262
va: 2.1224 2.0827 2.2815 3.7399 3.8941 3.8318 3.9059 3.9046 3.8906 4.1598 3.7446 3.9358 3.9519 3.8807 3.6553 3.9664 3.9287 3.6742 3.8567 3.6641 3.9801 3.9829 3.9677 3.9544 3.9532 1.0061 1.0312 1.0211 0.9978 1.0054 1.0052 1.0047 1.0070 1.0129 0.9990 1.0056 1.0111 1.0117 1.0040 1.0036 0.9944 1.0084 1.0098 1.0172 1.0061 1.0095 1.0119 1.0101 1.0005 1.0002 0.9996
dispcorr: -0.026703949 hartree
energy: -1079.756064876880
dipole: 15.03306 -15.46735 -0.43429 -11.07716 10.70026 -0.37689 2.53210 -3.04866 -0.51655
magnitude: 0.77297 au
magnitude: 1.96473 debye
