program: Orca
programVersion: 5.0.2
elementType: O O O C C C C C C C C C C C C C C C C C C C C C C H H H H H H H H H H H H H H H H H H H H H H H H H H
charge: 0
multiplicity: 1
keywords: wb97x-d3
keywords: def2-TZVPP
keywords: def2/J RIJCOSX
keywords: DEFGRID2
keywords: scfconv7
keywords: smallprint printgap noloewdin
keywords: NOSOSCF
formula: C22H26O3
InChI: InChI=1/C22H26O3/c1-15(2)10-19-20(22(19,3)4)21(23)25-14-17-12-18(24-13-17)11-16-8-6-5-7-9-16/h5-10,12-13,19-20H,11,14H2,1-4H3
51 atoms
O  2.031309 2.118351 -0.976757
O  2.358401 1.269692 1.064167
O  -2.281752 2.70026 -0.528723
C  3.984705 -0.965587 -0.349831
C  2.565058 -1.42192 -0.501215
C  2.96134 0.007099 -0.888074
C  4.602087 -0.801922 1.017477
C  4.970629 -1.479377 -1.374314
C  1.685373 -1.715784 0.644432
C  2.439764 1.166944 -0.134208
C  0.877062 -2.773506 0.766731
C  0.036805 -2.95091 1.997227
C  0.727313 -3.871305 -0.243225
C  1.332146 3.23939 -0.419917
C  -0.099064 2.910753 -0.185245
C  -0.669049 2.142442 0.879925
C  -1.135666 3.216571 -1.000941
C  -1.991247 2.03921 0.612655
C  -3.087182 1.278503 1.262875
C  -3.500073 0.06685 0.455823
C  -4.831671 -0.147694 0.125979
C  -2.547341 -0.855774 0.031533
C  -5.211022 -1.261123 -0.611461
C  -2.923416 -1.966925 -0.705228
C  -4.257286 -2.174677 -1.029604
H  2.38696 -2.03771 -1.375617
H  3.004515 0.181515 -1.956815
H  5.423211 -0.084232 0.979538
H  3.906713 -0.463099 1.777697
H  5.014805 -1.758878 1.341739
H  5.811804 -0.792861 -1.486319
H  5.369961 -2.448313 -1.069146
H  4.513411 -1.605286 -2.356961
H  1.705594 -1.010997 1.465895
H  0.196975 -2.152036 2.720261
H  0.2571 -3.900285 2.492336
H  -1.027724 -2.968536 1.748162
H  1.097167 -4.816158 0.163443
H  1.256523 -3.68957 -1.17584
H  -0.325403 -4.034452 -0.4858
H  1.426251 4.025777 -1.168127
H  1.820811 3.579188 0.49396
H  -0.149198 1.711558 1.718978
H  -1.19828 3.779008 -1.918923
H  -3.954928 1.921415 1.432836
H  -2.737015 0.966737 2.249871
H  -5.582567 0.566809 0.441916
H  -1.499504 -0.699521 0.263479
H  -6.253028 -1.40854 -0.863853
H  -2.168588 -2.668889 -1.035663
H  -4.548901 -3.04049 -1.609423
totalener: -1079.73023581 hartree
nucrepener: 2192.13219033 hartree
electener: -3271.86242614 hartree
oneelecener: -5822.62655772 hartree
twoeener: 2550.76413158 hartree
kineticenergy: 1074.90741181 hartree
xcener: -106.469329297156 hartree
chargesum: -0.0000000
charge: -0.263157 -0.414992 -0.247790 0.099949 0.040806 -0.094277 -0.250511 -0.242440 -0.214621 0.373797 -0.093820 -0.202861 -0.242415 0.058189 -0.059463 -0.277726 -0.036380 0.218352 -0.108852 0.047905 -0.133737 -0.152332 -0.122282 -0.149750 -0.140022 0.085805 0.081992 0.086013 0.101264 0.083963 0.089225 0.088553 0.070392 0.108874 0.081546 0.092215 0.080595 0.097242 0.081515 0.073699 0.096105 0.113141 0.151061 0.133456 0.089176 0.104737 0.103929 0.126051 0.121979 0.143075 0.122827
qa: -0.2632 -0.4150 -0.2478 0.0999 0.0408 -0.0943 -0.2505 -0.2424 -0.2146 0.3738 -0.0938 -0.2029 -0.2424 0.0582 -0.0595 -0.2777 -0.0364 0.2184 -0.1089 0.0479 -0.1337 -0.1523 -0.1223 -0.1498 -0.1400 0.0858 0.0820 0.0860 0.1013 0.0840 0.0892 0.0886 0.0704 0.1089 0.0815 0.0922 0.0806 0.0972 0.0815 0.0737 0.0961 0.1131 0.1511 0.1335 0.0892 0.1047 0.1039 0.1261 0.1220 0.1431 0.1228
va: 2.1358 2.0707 2.3132 3.7289 3.7861 3.8947 3.9160 3.9076 3.8524 4.1443 3.8047 3.9246 3.9372 3.8950 3.7264 3.9902 4.0052 3.6120 3.8815 3.7103 3.9672 3.9465 3.9674 3.9554 3.9947 1.0080 1.0304 1.0028 1.0200 1.0020 1.0050 1.0041 1.0082 1.0249 1.0108 1.0017 1.0000 0.9993 1.0161 1.0055 0.9964 1.0077 1.0210 1.0079 1.0142 1.0031 1.0109 1.0043 1.0009 0.9881 1.0018
dispcorr: -0.025964129 hartree
energy: -1079.756199938404
dipole: 13.02268 -12.95910 0.06358 -21.23565 20.96972 -0.26592 2.61093 -3.04917 -0.43825
magnitude: 0.51655 au
magnitude: 1.31295 debye
