program: Orca
programVersion: 5.0.2
elementType: O O O C C C C C C C C C C C C C C C C C C C C C C H H H H H H H H H H H H H H H H H H H H H H H H H H
charge: 0
multiplicity: 1
keywords: wb97x-d3
keywords: def2-TZVPP
keywords: def2/J RIJCOSX
keywords: DEFGRID2
keywords: scfconv7
keywords: smallprint printgap noloewdin
keywords: NOSOSCF
formula: C22H26O3
InChI: InChI=1/C22H26O3/c1-15(2)10-19-20(22(19,3)4)21(23)25-14-17-12-18(24-13-17)11-16-8-6-5-7-9-16/h5-10,12-13,19-20H,11,14H2,1-4H3
51 atoms
O  2.160084 1.894158 -0.835953
O  2.264631 0.93501 1.183341
O  -2.170776 2.74608 -0.797557
C  4.19519 -1.107015 -0.144344
C  2.826507 -1.641957 -0.389022
C  3.150321 -0.188272 -0.742601
C  4.700129 -0.903981 1.263102
C  5.283474 -1.535846 -1.101849
C  1.902888 -1.997763 0.715015
C  2.496725 0.90561 0.003062
C  0.572856 -2.006956 0.627048
C  -0.274388 -2.394636 1.799602
C  -0.180879 -1.600237 -0.600497
C  1.441441 3.004964 -0.296616
C  -0.022789 2.744483 -0.240761
C  -0.758605 1.993799 0.731515
C  -0.941544 3.169617 -1.139104
C  -2.054632 2.027117 0.342265
C  -3.291215 1.402671 0.8861
C  -3.579953 0.039494 0.297876
C  -3.656197 -1.078596 1.1187
C  -3.762325 -0.126614 -1.072955
C  -3.901655 -2.33786 0.588601
C  -4.004575 -1.382271 -1.605673
C  -4.0739 -2.493951 -0.776877
H  2.727409 -2.264815 -1.274781
H  3.263488 0.016505 -1.800909
H  5.152632 -1.829161 1.625861
H  5.473119 -0.133727 1.28005
H  3.926241 -0.606228 1.963598
H  4.903894 -1.683823 -2.113837
H  6.078859 -0.79003 -1.151789
H  5.730105 -2.477252 -0.77667
H  2.357293 -2.283424 1.657895
H  -0.905698 -1.557998 2.108477
H  0.325884 -2.700444 2.655648
H  -0.95257 -3.212502 1.544915
H  0.466806 -1.394566 -1.450754
H  -0.76705 -0.698059 -0.407308
H  -0.89898 -2.369133 -0.894714
H  1.650787 3.831508 -0.975665
H  1.828684 3.270462 0.688068
H  -0.356486 1.489784 1.595062
H  -0.86489 3.770159 -2.031435
H  -4.141943 2.069343 0.71801
H  -3.18214 1.313522 1.968132
H  -3.517776 -0.967593 2.187856
H  -3.709489 0.730747 -1.73212
H  -3.954634 -3.196111 1.245873
H  -4.140238 -1.49416 -2.673523
H  -4.263928 -3.473965 -1.194405
totalener: -1079.72856173 hartree
nucrepener: 2233.22650831 hartree
electener: -3312.95507004 hartree
oneelecener: -5905.10830009 hartree
twoeener: 2592.15323006 hartree
kineticenergy: 1074.91544583 hartree
xcener: -106.470961756595 hartree
chargesum: 0.0000000
charge: -0.265421 -0.397466 -0.261938 0.138709 -0.057563 -0.109999 -0.285316 -0.242540 -0.155065 0.370438 0.016944 -0.236376 -0.240765 0.050211 -0.022796 -0.345988 -0.039942 0.285034 -0.109527 0.028866 -0.165204 -0.143654 -0.120821 -0.108117 -0.148733 0.091795 0.080402 0.087368 0.084683 0.105685 0.070232 0.089232 0.087233 0.080759 0.073318 0.087450 0.084006 0.090047 0.063456 0.093815 0.094729 0.111050 0.153361 0.134709 0.109211 0.091744 0.112479 0.114927 0.126108 0.123973 0.125260
qa: -0.2654 -0.3975 -0.2619 0.1387 -0.0576 -0.1100 -0.2853 -0.2425 -0.1551 0.3704 0.0169 -0.2364 -0.2408 0.0502 -0.0228 -0.3460 -0.0399 0.2850 -0.1095 0.0289 -0.1652 -0.1437 -0.1208 -0.1081 -0.1487 0.0918 0.0804 0.0874 0.0847 0.1057 0.0702 0.0892 0.0872 0.0808 0.0733 0.0875 0.0840 0.0900 0.0635 0.0938 0.0947 0.1110 0.1534 0.1347 0.1092 0.0917 0.1125 0.1149 0.1261 0.1240 0.1253
va: 2.1218 2.0856 2.2964 3.7311 3.9000 3.8444 3.9109 3.9020 3.8624 4.1342 3.7018 3.9624 3.9538 3.9180 3.6906 3.9873 3.9963 3.5239 3.8425 3.6765 3.9144 3.9542 3.9093 3.9326 3.9359 1.0057 1.0324 0.9978 1.0048 1.0196 1.0076 1.0050 1.0045 1.0119 1.0000 1.0164 1.0013 1.0155 1.0119 1.0046 0.9965 1.0089 1.0198 1.0072 1.0072 1.0120 1.0081 1.0237 1.0012 1.0006 1.0002
dispcorr: -0.029385450 hartree
energy: -1079.757947179953
dipole: 11.42382 -11.56254 -0.13873 -15.98208 15.94349 -0.03859 2.67547 -3.12517 -0.44970
magnitude: 0.47219 au
magnitude: 1.20022 debye
