program: Orca
programVersion: 5.0.2
elementType: O O O C C C C C C C C C C C C C C C C C C C C C C H H H H H H H H H H H H H H H H H H H H H H H H H H
charge: 0
multiplicity: 1
keywords: wb97x-d3
keywords: def2-TZVPP
keywords: def2/J RIJCOSX
keywords: DEFGRID2
keywords: scfconv7
keywords: smallprint printgap noloewdin
keywords: NOSOSCF
formula: C22H26O3
InChI: InChI=1/C22H26O3/c1-15(2)10-19-20(22(19,3)4)21(23)25-14-17-12-18(24-13-17)11-16-8-6-5-7-9-16/h5-10,12-13,19-20H,11,14H2,1-4H3
51 atoms
O  1.007207 -1.035095 0.100921
O  3.076441 -1.789511 -0.279132
O  -2.877624 -2.192444 1.69162
C  3.131182 0.902852 -1.978732
C  3.982802 1.00802 -0.747891
C  2.552969 0.523862 -0.626187
C  2.564023 2.152364 -2.605974
C  3.466692 -0.162917 -2.99245
C  4.36414 2.294392 -0.133548
C  2.277801 -0.877804 -0.261609
C  5.597119 2.603022 0.278856
C  5.894003 3.924833 0.91731
C  6.762829 1.657815 0.148005
C  0.573835 -2.349548 0.492946
C  -0.891474 -2.275123 0.705337
C  -1.905764 -2.142174 -0.298251
C  -1.543728 -2.29427 1.889631
C  -3.090296 -2.096602 0.352983
C  -4.492169 -1.917338 -0.104167
C  -5.026727 -0.557342 0.275315
C  -4.731105 0.554443 -0.509617
C  -5.780471 -0.382765 1.431196
C  -5.181193 1.81571 -0.147877
C  -6.233013 0.879056 1.796052
C  -5.932641 1.98218 1.008933
H  4.724824 0.220346 -0.663041
H  1.836174 1.234846 -0.230132
H  3.298648 2.613881 -3.268634
H  2.265318 2.897321 -1.869913
H  1.684359 1.911466 -3.205568
H  4.133817 0.251894 -3.750222
H  2.568449 -0.513077 -3.504806
H  3.968136 -1.026572 -2.560757
H  3.574856 3.02857 -0.00162
H  5.007771 4.55432 0.995783
H  6.303551 3.790231 1.922002
H  6.650516 4.473003 0.349635
H  7.693778 2.136408 0.451109
H  6.638856 0.771456 0.774505
H  6.89714 1.307072 -0.876507
H  1.085981 -2.651399 1.409014
H  0.817748 -3.070927 -0.289118
H  -1.762668 -2.088421 -1.366166
H  -1.205516 -2.384439 2.910364
H  -5.129119 -2.700653 0.314696
H  -4.507018 -2.038634 -1.187925
H  -4.142752 0.429933 -1.411443
H  -6.019527 -1.239822 2.049641
H  -4.948759 2.669387 -0.771498
H  -6.818726 1.000085 2.698295
H  -6.286173 2.965332 1.291139
elementType: O C H
totalener: -1079.74077803 hartree
nucrepener: 2019.82664217 hartree
electener: -3099.56742020 hartree
oneelecener: -5478.79620720 hartree
twoeener: 2379.22878700 hartree
cpcmener: -0.03197249 hartree
kineticenergy: 1074.85183912 hartree
xcener: -106.458152527743 hartree
chargesum: -0.0000000
charge: -0.277404 -0.507617 -0.286281 0.101885 0.053168 -0.102722 -0.271252 -0.276039 -0.310213 0.426339 -0.012251 -0.222228 -0.283544 0.084654 -0.089478 -0.321828 -0.024337 0.190676 -0.053602 0.054038 -0.204730 -0.199113 -0.157853 -0.158417 -0.177162 0.088179 0.089833 0.097933 0.089113 0.097951 0.097635 0.100712 0.089445 0.120957 0.085646 0.098289 0.096146 0.096115 0.102652 0.103784 0.116262 0.112943 0.165028 0.179486 0.113402 0.113847 0.145165 0.142945 0.161002 0.160043 0.160798
qa: -0.2774 -0.5076 -0.2863 0.1019 0.0532 -0.1027 -0.2713 -0.2760 -0.3102 0.4263 -0.0123 -0.2222 -0.2835 0.0847 -0.0895 -0.3218 -0.0243 0.1907 -0.0536 0.0540 -0.2047 -0.1991 -0.1579 -0.1584 -0.1772 0.0882 0.0898 0.0979 0.0891 0.0980 0.0976 0.1007 0.0894 0.1210 0.0856 0.0983 0.0961 0.0961 0.1027 0.1038 0.1163 0.1129 0.1650 0.1795 0.1134 0.1138 0.1452 0.1429 0.1610 0.1600 0.1608
va: 2.1206 1.9931 2.2672 3.7069 3.7464 3.8847 3.9126 3.9055 3.8960 4.1255 3.6908 3.9199 3.9398 3.8424 3.7313 3.9962 3.9430 3.6407 3.8162 3.5707 3.9399 3.9507 3.8922 3.8902 3.8947 1.0315 1.0360 1.0015 1.0057 1.0020 1.0005 0.9991 1.0181 1.0093 1.0100 0.9925 0.9930 1.0044 0.9966 0.9957 0.9987 0.9953 1.0066 0.9932 1.0069 1.0085 1.0027 1.0058 0.9897 0.9898 0.9895
dispcorr: -0.021101682 hartree
energy: -1079.761879712858
dipole: 26.29878 -26.86127 -0.56249 17.22061 -16.55352 0.66708 -9.23671 8.83071 -0.40600
magnitude: 0.96240 au
magnitude: 2.44624 debye
