program: Orca
programVersion: 5.0.2
elementType: O O O C C C C C C C C C C C C C C C C C C C C C C H H H H H H H H H H H H H H H H H H H H H H H H H H
charge: 0
multiplicity: 1
keywords: wb97x-d3
keywords: def2-TZVPP
keywords: def2/J RIJCOSX
keywords: DEFGRID2
keywords: scfconv7
keywords: smallprint printgap noloewdin
keywords: NOSOSCF
formula: C22H26O3
InChI: InChI=1/C22H26O3/c1-15(2)10-19-20(22(19,3)4)21(23)25-14-17-12-18(24-13-17)11-16-8-6-5-7-9-16/h5-10,12-13,19-20H,11,14H2,1-4H3
51 atoms
O  1.434246 -1.150924 -0.791655
O  1.891472 -1.168127 1.397047
O  -2.903081 -0.149365 -0.591031
C  2.951105 1.559723 -0.615913
C  3.715248 0.529871 -1.397078
C  3.208502 0.18882 -0.010855
C  3.681998 2.711354 0.030709
C  1.569098 1.940671 -1.091316
C  5.173287 0.628288 -1.610215
C  2.124208 -0.768239 0.275656
C  5.824494 0.471185 -2.767543
C  7.31635 0.608632 -2.830851
C  5.174995 0.161265 -4.081394
C  0.266625 -1.970561 -0.604857
C  -0.93508 -1.14456 -0.315748
C  -1.251242 -0.394394 0.866536
C  -1.973839 -0.949118 -1.160346
C  -2.451147 0.18944 0.644308
C  -3.332998 1.036807 1.487189
C  -4.551729 0.277124 1.95303
C  -5.75345 0.358449 1.257237
C  -4.47477 -0.553075 3.068582
C  -6.859846 -0.374439 1.66888
C  -5.57865 -1.284015 3.483736
C  -6.775372 -1.197714 2.783096
H  3.151448 0.092217 -2.212671
H  3.954589 0.189665 0.776698
H  4.643712 2.422562 0.452145
H  3.082532 3.133098 0.839467
H  3.860404 3.506231 -0.69618
H  1.633105 2.84546 -1.69866
H  0.908293 2.158681 -0.249585
H  1.095811 1.176869 -1.704265
H  5.766617 0.854106 -0.728621
H  7.607345 1.401348 -3.525008
H  7.751753 0.836324 -1.858091
H  7.779713 -0.309321 -3.201751
H  5.379556 0.955618 -4.803801
H  5.590214 -0.754902 -4.508682
H  4.095239 0.040346 -4.022843
H  0.446524 -2.713061 0.172678
H  0.140386 -2.498623 -1.548312
H  -0.668813 -0.306153 1.769021
H  -2.180068 -1.30631 -2.157499
H  -3.636388 1.930417 0.935804
H  -2.749138 1.373564 2.344782
H  -5.828122 1.00314 0.389565
H  -3.54288 -0.626257 3.617348
H  -7.789017 -0.300019 1.118774
H  -5.505115 -1.920353 4.356269
H  -7.637126 -1.766994 3.106378
elementType: O C H
totalener: -1079.73945148 hartree
nucrepener: 2062.23926283 hartree
electener: -3141.97871431 hartree
oneelecener: -5563.57978513 hartree
twoeener: 2421.60107082 hartree
cpcmener: -0.03128180 hartree
kineticenergy: 1074.85198829 hartree
xcener: -106.461353430940 hartree
chargesum: 0.0000000
charge: -0.276906 -0.504652 -0.286923 0.112807 0.065606 -0.122320 -0.276073 -0.287173 -0.298814 0.439746 -0.049253 -0.221208 -0.252143 0.050988 -0.079523 -0.329185 -0.028055 0.213133 -0.052185 0.052734 -0.199963 -0.204527 -0.158694 -0.158492 -0.177202 0.102866 0.090809 0.089193 0.098808 0.096271 0.100331 0.099846 0.090070 0.121420 0.093709 0.089059 0.093590 0.096894 0.095318 0.088626 0.123294 0.118214 0.159949 0.179442 0.114357 0.114996 0.143513 0.145653 0.159529 0.160752 0.161769
qa: -0.2769 -0.5047 -0.2869 0.1128 0.0656 -0.1223 -0.2761 -0.2872 -0.2988 0.4397 -0.0493 -0.2212 -0.2521 0.0510 -0.0795 -0.3292 -0.0281 0.2131 -0.0522 0.0527 -0.2000 -0.2045 -0.1587 -0.1585 -0.1772 0.1029 0.0908 0.0892 0.0988 0.0963 0.1003 0.0998 0.0901 0.1214 0.0937 0.0891 0.0936 0.0969 0.0953 0.0886 0.1233 0.1182 0.1599 0.1794 0.1144 0.1150 0.1435 0.1457 0.1595 0.1608 0.1618
va: 2.1106 1.9861 2.2700 3.6689 3.7363 3.8515 3.9110 3.9045 3.8516 4.1349 3.7618 3.9213 3.9416 3.8532 3.6500 3.9987 3.9581 3.6574 3.8096 3.5744 3.9522 3.9379 3.8924 3.8923 3.8934 1.0234 1.0345 1.0060 1.0009 1.0019 1.0029 1.0002 1.0158 1.0103 0.9958 1.0088 0.9962 0.9969 0.9968 1.0118 1.0073 1.0009 1.0228 0.9924 1.0076 1.0084 1.0055 1.0027 0.9901 0.9898 0.9891
dispcorr: -0.023031179 hartree
energy: -1079.762482657088
dipole: 25.73001 -25.60533 0.12467 10.93915 -10.32541 0.61374 -12.19429 10.94996 -1.24432
magnitude: 1.39304 au
magnitude: 3.54082 debye
