program: Orca
programVersion: 5.0.2
elementType: O O O C C C C C C C C C C C C C C C C C C C C C C H H H H H H H H H H H H H H H H H H H H H H H H H H
charge: 0
multiplicity: 1
keywords: wb97x-d3
keywords: def2-TZVPP
keywords: def2/J RIJCOSX
keywords: DEFGRID2
keywords: scfconv7
keywords: smallprint printgap noloewdin
keywords: NOSOSCF
formula: C22H26O3
InChI: InChI=1/C22H26O3/c1-15(2)10-19-20(22(19,3)4)21(23)25-14-17-12-18(24-13-17)11-16-8-6-5-7-9-16/h5-10,12-13,19-20H,11,14H2,1-4H3
51 atoms
O  1.674661 -2.106348 -0.1372
O  1.258172 -0.301184 1.116652
O  -2.535033 -3.095894 -0.896743
C  3.959301 0.648833 -0.231869
C  2.784115 1.348991 -0.84144
C  2.770615 -0.157958 -0.733138
C  5.225343 0.515251 -1.041218
C  4.218143 0.812377 1.24428
C  2.841774 1.974779 -2.184697
C  1.830676 -0.824859 0.185991
C  2.881331 3.28916 -2.422151
C  2.919284 3.825542 -3.820427
C  2.899722 4.330853 -1.347127
C  0.774828 -2.916564 0.642937
C  -0.637078 -2.755864 0.205192
C  -1.604309 -1.783913 0.628322
C  -1.262826 -3.51906 -0.719506
C  -2.73464 -2.032747 -0.073293
C  -4.077102 -1.393207 -0.120654
C  -4.192692 -0.285611 0.889452
C  -3.701684 0.98591 0.605035
C  -4.763824 -0.521406 2.135745
C  -3.779024 2.000988 1.548241
C  -4.846642 0.492981 3.080519
C  -4.352715 1.75702 2.789596
H  2.149502 1.85339 -0.118819
H  2.959181 -0.702176 -1.652496
H  5.831808 -0.313682 -0.672019
H  5.824171 1.424565 -0.959533
H  5.032762 0.339018 -2.098998
H  4.896123 1.653689 1.400749
H  4.698861 -0.075592 1.659613
H  3.318118 1.011473 1.821787
H  2.853971 1.299645 -3.035661
H  2.065574 4.481069 -4.01097
H  3.814474 4.431006 -3.983589
H  2.907674 3.032174 -4.567324
H  2.878035 3.917756 -0.34046
H  3.798992 4.94642 -1.431595
H  2.051996 5.012836 -1.449958
H  0.893912 -2.701906 1.705132
H  1.110737 -3.937195 0.468242
H  -1.469589 -1.009338 1.365453
H  -0.947303 -4.369422 -1.30421
H  -4.848687 -2.146173 0.061366
H  -4.258436 -1.002721 -1.126755
H  -3.255116 1.183177 -0.362504
H  -5.150541 -1.506445 2.368495
H  -3.393833 2.984568 1.312573
H  -5.298697 0.294955 4.043744
H  -4.416837 2.548705 3.524704
elementType: O C H
totalener: -1079.74017876 hartree
nucrepener: 2082.08358538 hartree
electener: -3161.82376414 hartree
oneelecener: -5603.92479496 hartree
twoeener: 2442.10103081 hartree
cpcmener: -0.02972735 hartree
kineticenergy: 1074.85444094 hartree
xcener: -106.460665707049 hartree
chargesum: -0.0000000
charge: -0.288714 -0.509657 -0.286490 0.148003 0.003885 -0.129774 -0.265054 -0.292458 -0.275738 0.443930 -0.033374 -0.229480 -0.251576 0.071229 -0.117929 -0.256779 -0.036121 0.168822 0.004750 -0.000773 -0.202384 -0.192071 -0.154735 -0.156053 -0.171482 0.094620 0.090599 0.099005 0.095712 0.090813 0.096090 0.101198 0.090892 0.123897 0.095320 0.094252 0.089955 0.088462 0.096259 0.097729 0.119894 0.123753 0.159046 0.180320 0.103895 0.108799 0.144717 0.142134 0.160764 0.160483 0.161415
qa: -0.2887 -0.5097 -0.2865 0.1480 0.0039 -0.1298 -0.2651 -0.2925 -0.2757 0.4439 -0.0334 -0.2295 -0.2516 0.0712 -0.1179 -0.2568 -0.0361 0.1688 0.0048 -0.0008 -0.2024 -0.1921 -0.1547 -0.1561 -0.1715 0.0946 0.0906 0.0990 0.0957 0.0908 0.0961 0.1012 0.0909 0.1239 0.0953 0.0943 0.0900 0.0885 0.0963 0.0977 0.1199 0.1238 0.1590 0.1803 0.1039 0.1088 0.1447 0.1421 0.1608 0.1605 0.1614
va: 2.1248 1.9913 2.2659 3.6648 3.7677 3.8954 3.9064 3.9006 3.8726 4.1228 3.7048 3.9253 3.9442 3.8368 3.7084 3.9525 3.9694 3.7185 3.8203 3.6187 3.9241 3.9322 3.8878 3.8894 3.8897 1.0279 1.0376 1.0028 1.0029 1.0025 1.0009 0.9991 1.0188 1.0069 0.9952 0.9962 1.0079 1.0082 0.9974 0.9981 1.0081 0.9976 1.0140 0.9922 1.0090 1.0041 1.0029 1.0038 0.9897 0.9897 0.9891
dispcorr: -0.022364573 hartree
energy: -1079.762543337334
dipole: 22.82575 -22.25974 0.56601 20.85451 -20.97113 -0.11662 -6.84762 6.23210 -0.61552
magnitude: 0.84430 au
magnitude: 2.14603 debye
