program: Orca
programVersion: 5.0.2
elementType: O O O C C C C C C C C C C C C C C C C C C C C C C H H H H H H H H H H H H H H H H H H H H H H H H H H
charge: 0
multiplicity: 1
keywords: wb97x-d3
keywords: def2-TZVPP
keywords: def2/J RIJCOSX
keywords: DEFGRID2
keywords: scfconv7
keywords: smallprint printgap noloewdin
keywords: NOSOSCF
formula: C22H26O3
InChI: InChI=1/C22H26O3/c1-15(2)10-19-20(22(19,3)4)21(23)25-14-17-12-18(24-13-17)11-16-8-6-5-7-9-16/h5-10,12-13,19-20H,11,14H2,1-4H3
51 atoms
O  1.473854 -2.224023 -1.249801
O  1.95668 -1.839749 0.897895
O  -2.192083 -3.228227 1.228299
C  3.674872 0.528202 -0.235569
C  2.315745 1.059623 0.099667
C  2.446124 -0.183522 -0.767653
C  4.508524 1.240935 -1.272899
C  4.504776 -0.072051 0.872215
C  1.757796 2.285369 -0.508026
C  1.960494 -1.47565 -0.256258
C  1.294771 3.354663 0.147887
C  0.726005 4.523717 -0.598145
C  1.301315 3.507845 1.638043
C  0.78302 -3.4308 -0.905967
C  -0.487432 -3.131618 -0.190325
C  -1.374385 -2.037866 -0.451394
C  -1.031096 -3.813975 0.840996
C  -2.384674 -2.13841 0.444369
C  -3.591588 -1.307049 0.707075
C  -3.384387 0.122935 0.280944
C  -4.155224 0.694103 -0.72459
C  -2.404128 0.899698 0.897729
C  -3.952713 2.014747 -1.111888
C  -2.200913 2.215837 0.515442
C  -2.972853 2.777789 -0.495265
H  2.004724 0.855611 1.119198
H  2.259835 -0.029034 -1.82465
H  3.914902 1.62382 -2.102083
H  5.258548 0.565526 -1.68822
H  5.036311 2.084136 -0.822953
H  5.154552 0.698001 1.292541
H  5.146756 -0.870589 0.4953
H  3.908754 -0.473461 1.688089
H  1.724028 2.304972 -1.593624
H  0.769308 4.385205 -1.678244
H  -0.319027 4.690987 -0.321737
H  1.260007 5.4453 -0.352529
H  1.612023 2.611297 2.171392
H  1.977019 4.316112 1.931804
H  0.311786 3.791315 2.005786
H  1.420154 -4.098783 -0.323032
H  0.592047 -3.90963 -1.865881
H  -1.258971 -1.266512 -1.196587
H  -0.720593 -4.690077 1.388621
H  -3.823044 -1.345103 1.775337
H  -4.460602 -1.725547 0.191438
H  -4.922232 0.103048 -1.210725
H  -1.794328 0.469563 1.683808
H  -4.562546 2.44348 -1.896663
H  -1.443253 2.808042 1.011221
H  -2.811193 3.805581 -0.794181
elementType: O C H
totalener: -1079.73860551 hartree
nucrepener: 2193.26917571 hartree
electener: -3273.00778123 hartree
oneelecener: -5826.13191901 hartree
twoeener: 2553.12413779 hartree
cpcmener: -0.03230382 hartree
kineticenergy: 1074.85203206 hartree
xcener: -106.464347084462 hartree
chargesum: 0.0000000
charge: -0.294959 -0.495568 -0.287463 0.128770 0.035728 -0.102976 -0.267020 -0.284548 -0.266703 0.408375 -0.089129 -0.215128 -0.255539 0.114406 -0.084427 -0.319860 -0.047608 0.196849 -0.025079 0.030543 -0.191068 -0.258290 -0.132974 -0.125051 -0.207725 0.100001 0.088231 0.089214 0.098512 0.096812 0.095216 0.099783 0.091741 0.121470 0.092846 0.082693 0.102723 0.093273 0.108128 0.093488 0.119213 0.117430 0.160206 0.179232 0.110866 0.099691 0.142664 0.145455 0.160155 0.188281 0.159117
qa: -0.2950 -0.4956 -0.2875 0.1288 0.0357 -0.1030 -0.2670 -0.2845 -0.2667 0.4084 -0.0891 -0.2151 -0.2555 0.1144 -0.0844 -0.3199 -0.0476 0.1968 -0.0251 0.0305 -0.1911 -0.2583 -0.1330 -0.1251 -0.2077 0.1000 0.0882 0.0892 0.0985 0.0968 0.0952 0.0998 0.0917 0.1215 0.0928 0.0827 0.1027 0.0933 0.1081 0.0935 0.1192 0.1174 0.1602 0.1792 0.1109 0.0997 0.1427 0.1455 0.1602 0.1883 0.1591
va: 2.1122 2.0000 2.2651 3.6984 3.7522 3.8618 3.9086 3.8965 3.8155 4.1202 3.7692 3.9103 3.9308 3.8161 3.6809 3.9491 3.9505 3.6506 3.8012 3.6241 3.9292 3.9828 3.8940 3.7973 3.9270 1.0265 1.0402 1.0046 1.0022 1.0023 1.0002 0.9993 1.0205 1.0097 1.0073 0.9967 0.9985 1.0087 0.9967 0.9981 1.0056 0.9881 1.0081 0.9928 1.0080 1.0063 1.0034 1.0043 0.9898 0.9611 0.9923
dispcorr: -0.025961194 hartree
energy: -1079.764566705222
dipole: 14.94935 -14.99160 -0.04225 22.97772 -22.27269 0.70502 -0.86156 -0.07395 -0.93551
magnitude: 1.17219 au
magnitude: 2.97947 debye
