program: Orca
programVersion: 5.0.2
elementType: O O O C C C C C C C C C C C C C C C C C C C C C C H H H H H H H H H H H H H H H H H H H H H H H H H H
charge: 0
multiplicity: 1
keywords: wb97x-d3
keywords: def2-TZVPP
keywords: def2/J RIJCOSX
keywords: DEFGRID2
keywords: scfconv7
keywords: smallprint printgap noloewdin
keywords: NOSOSCF
formula: C22H26O3
InChI: InChI=1/C22H26O3/c1-15(2)10-19-20(22(19,3)4)21(23)25-14-17-12-18(24-13-17)11-16-8-6-5-7-9-16/h5-10,12-13,19-20H,11,14H2,1-4H3
51 atoms
O  1.698002 -2.143836 0.01227
O  1.195263 -1.18276 -1.946793
O  -2.380317 -2.709875 1.398864
C  1.756333 1.309194 -0.027843
C  2.742128 1.231179 -1.160553
C  2.483413 0.005563 -0.31616
C  2.126641 2.01156 1.255661
C  0.288243 1.435931 -0.358323
C  4.07497 1.862988 -1.101282
C  1.734952 -1.141144 -0.863539
C  4.689748 2.529791 -2.08384
C  6.066851 3.089019 -1.881894
C  4.116772 2.774037 -3.446736
C  0.830477 -3.26241 -0.256777
C  -0.564874 -2.935614 0.139111
C  -1.551465 -2.191562 -0.589623
C  -1.130602 -3.218779 1.335677
C  -2.628855 -2.08027 0.220818
C  -3.917457 -1.353462 0.091012
C  -3.899772 -0.082539 0.907854
C  -4.404431 -0.053795 2.203866
C  -3.319306 1.070745 0.386133
C  -4.330616 1.106666 2.964774
C  -3.244224 2.2310 1.143167
C  -3.749498 2.251427 2.437293
H  2.27898 1.202741 -2.140721
H  3.241999 -0.257472 0.413362
H  1.495481 1.660332 2.074075
H  1.971729 3.088157 1.160439
H  3.162573 1.847886 1.54907
H  0.026992 1.019151 -1.329082
H  0.001096 2.489223 -0.368609
H  -0.322196 0.938471 0.398354
H  4.610614 1.750591 -0.16285
H  6.075221 4.173013 -2.021872
H  6.458088 2.873496 -0.88789
H  6.766294 2.679555 -2.615605
H  4.188048 3.833394 -3.705407
H  4.689366 2.234978 -4.206408
H  3.073667 2.48064 -3.548049
H  1.223056 -4.071953 0.355779
H  0.902856 -3.564459 -1.30139
H  -1.469495 -1.7909 -1.586811
H  -0.777672 -3.759803 2.200153
H  -4.749791 -1.991151 0.398316
H  -4.064728 -1.118717 -0.963743
H  -4.861739 -0.942545 2.622352
H  -2.919697 1.058438 -0.621611
H  -4.72746 1.115427 3.971822
H  -2.790672 3.11928 0.722199
H  -3.6920 3.155153 3.029959
elementType: O C H
totalener: -1079.74069302 hartree
nucrepener: 2140.78666888 hartree
electener: -3220.52736190 hartree
oneelecener: -5721.06646486 hartree
twoeener: 2500.53910296 hartree
cpcmener: -0.02988821 hartree
kineticenergy: 1074.85396106 hartree
xcener: -106.461509276353 hartree
chargesum: 0.0000000
charge: -0.284623 -0.494644 -0.284657 0.133500 0.031325 -0.096817 -0.276528 -0.310736 -0.286687 0.418166 -0.050445 -0.219377 -0.256170 0.069393 -0.059456 -0.359222 -0.034442 0.218152 -0.043806 0.093030 -0.205007 -0.270086 -0.154920 -0.145603 -0.178039 0.089925 0.094089 0.098096 0.097959 0.091278 0.096705 0.106305 0.102741 0.120190 0.093907 0.089112 0.093132 0.094050 0.099521 0.091439 0.120913 0.121085 0.160671 0.178602 0.113491 0.113135 0.142422 0.155519 0.159983 0.162097 0.161333
qa: -0.2846 -0.4946 -0.2847 0.1335 0.0313 -0.0968 -0.2765 -0.3107 -0.2867 0.4182 -0.0504 -0.2194 -0.2562 0.0694 -0.0595 -0.3592 -0.0344 0.2182 -0.0438 0.0930 -0.2050 -0.2701 -0.1549 -0.1456 -0.1780 0.0899 0.0941 0.0981 0.0980 0.0913 0.0967 0.1063 0.1027 0.1202 0.0939 0.0891 0.0931 0.0941 0.0995 0.0914 0.1209 0.1211 0.1607 0.1786 0.1135 0.1131 0.1424 0.1555 0.1600 0.1621 0.1613
va: 2.1179 2.0064 2.2684 3.6813 3.7884 3.8133 3.8997 3.9115 3.8784 4.1784 3.7599 3.9200 3.9401 3.8422 3.6447 3.9775 3.9678 3.6233 3.8091 3.5187 3.9633 3.9250 3.8879 3.8648 3.9059 1.0328 1.0347 1.0019 1.0016 1.0063 1.0153 1.0009 0.9887 1.0107 0.9965 1.0088 0.9955 0.9976 0.9955 1.0092 0.9973 1.0077 1.0189 0.9926 1.0090 1.0091 1.0061 0.9946 0.9895 0.9891 0.9890
dispcorr: -0.024928256 hartree
energy: -1079.765621272316
dipole: 18.12928 -17.93447 0.19481 21.26630 -21.02467 0.24163 -5.93593 6.59981 0.66388
magnitude: 0.73285 au
magnitude: 1.86276 debye
