program: Orca
programVersion: 5.0.2
elementType: O O O C C C C C C C C C C C C C C C C C C C C C C H H H H H H H H H H H H H H H H H H H H H H H H H H
charge: 0
multiplicity: 1
keywords: wb97x-d3
keywords: def2-TZVPP
keywords: def2/J RIJCOSX
keywords: DEFGRID2
keywords: scfconv7
keywords: smallprint printgap noloewdin
keywords: NOSOSCF
formula: C22H26O3
InChI: InChI=1/C22H26O3/c1-15(2)10-19-20(22(19,3)4)21(23)25-14-17-12-18(24-13-17)11-16-8-6-5-7-9-16/h5-10,12-13,19-20H,11,14H2,1-4H3
51 atoms
O  1.425567 -1.670566 -1.112994
O  0.592897 0.346254 -1.607041
O  -1.769081 -1.721189 1.613196
C  2.900481 1.229582 0.367064
C  3.269291 1.545382 -1.04062
C  2.80022 0.145739 -0.70178
C  3.995071 1.022001 1.385029
C  1.652874 1.837205 0.958709
C  4.677939 1.764409 -1.462494
C  1.500213 -0.336898 -1.187727
C  5.184963 1.394198 -2.641405
C  6.615812 1.658648 -2.995683
C  4.389493 0.687798 -3.694739
C  0.180607 -2.282859 -1.447624
C  -0.821629 -2.102644 -0.360266
C  -2.239879 -2.254007 -0.483868
C  -0.593918 -1.781942 0.933857
C  -2.764238 -2.011108 0.740366
C  -4.158051 -1.940935 1.244728
C  -4.52992 -0.537501 1.660983
C  -4.772512 -0.225428 2.993596
C  -4.611072 0.47594 0.70753
C  -5.092167 1.073994 3.370326
C  -4.929486 1.772823 1.079714
C  -5.170387 2.076611 2.414905
H  2.528517 2.134905 -1.576456
H  3.569736 -0.615591 -0.642886
H  4.318599 1.97941 1.799385
H  4.870648 0.526799 0.965008
H  3.634156 0.410611 2.213902
H  0.90878 2.106984 0.211274
H  1.914749 2.750351 1.498475
H  1.184342 1.155996 1.673397
H  5.326719 2.278957 -0.759026
H  7.138694 0.726624 -3.225612
H  6.689885 2.280734 -3.891325
H  7.154861 2.158528 -2.191221
H  3.339063 0.567574 -3.436189
H  4.440089 1.230374 -4.642017
H  4.80392 -0.305111 -3.889242
H  0.414948 -3.33838 -1.592943
H  -0.204056 -1.904258 -2.397152
H  -2.794208 -2.498044 -1.376834
H  0.299485 -1.573681 1.501887
H  -4.295559 -2.62546 2.085744
H  -4.817465 -2.286585 0.446557
H  -4.71279 -1.004255 3.744671
H  -4.420699 0.24682 -0.334863
H  -5.277885 1.301393 4.412172
H  -4.989945 2.548931 0.327528
H  -5.416615 3.089365 2.706332
elementType: O C H
totalener: -1079.73908796 hartree
nucrepener: 2092.34062217 hartree
electener: -3172.07971013 hartree
oneelecener: -5624.39030651 hartree
twoeener: 2452.31059637 hartree
cpcmener: -0.03219550 hartree
kineticenergy: 1074.84554814 hartree
xcener: -106.461043542441 hartree
chargesum: -0.0000000
charge: -0.296442 -0.496456 -0.292624 0.154407 -0.013340 -0.100350 -0.287308 -0.282160 -0.300307 0.382483 -0.015182 -0.229331 -0.242514 0.115119 -0.032486 -0.350158 -0.062965 0.204375 -0.047750 0.017805 -0.184328 -0.190433 -0.158793 -0.164231 -0.171631 0.103783 0.096250 0.099333 0.094097 0.098152 0.093174 0.100293 0.096671 0.124416 0.095002 0.096682 0.089949 0.081264 0.101439 0.100005 0.121563 0.115802 0.164599 0.176678 0.107698 0.117204 0.143047 0.146729 0.159672 0.160525 0.160572
qa: -0.2964 -0.4965 -0.2926 0.1544 -0.0133 -0.1003 -0.2873 -0.2822 -0.3003 0.3825 -0.0152 -0.2293 -0.2425 0.1151 -0.0325 -0.3502 -0.0630 0.2044 -0.0477 0.0178 -0.1843 -0.1904 -0.1588 -0.1642 -0.1716 0.1038 0.0963 0.0993 0.0941 0.0982 0.0932 0.1003 0.0967 0.1244 0.0950 0.0967 0.0899 0.0813 0.1014 0.1000 0.1216 0.1158 0.1646 0.1767 0.1077 0.1172 0.1430 0.1467 0.1597 0.1605 0.1606
va: 2.1107 1.9908 2.2561 3.6938 3.8267 3.8034 3.9065 3.8866 3.8913 4.1470 3.7065 3.9301 3.9361 3.8047 3.6113 4.0064 3.9435 3.6255 3.8164 3.6176 3.9377 3.9268 3.8892 3.9015 3.8910 1.0254 1.0310 0.9996 1.0016 1.0031 1.0166 1.0024 1.0016 1.0030 0.9963 0.9961 1.0062 1.0141 0.9996 0.9983 0.9918 1.0119 1.0046 0.9954 1.0076 1.0064 1.0031 1.0028 0.9901 0.9904 0.9895
dispcorr: -0.023397206 hartree
energy: -1079.762485168101
dipole: 24.05885 -23.40389 0.65496 10.50454 -11.30063 -0.79608 -5.84608 5.79700 -0.04908
magnitude: 1.03205 au
magnitude: 2.62326 debye
