program: Orca
programVersion: 5.0.2
elementType: O O O C C C C C C C C C C C C C C C C C C C C C C H H H H H H H H H H H H H H H H H H H H H H H H H H
charge: 0
multiplicity: 1
keywords: wb97x-d3
keywords: def2-TZVPP
keywords: def2/J RIJCOSX
keywords: DEFGRID2
keywords: scfconv7
keywords: smallprint printgap noloewdin
keywords: NOSOSCF
formula: C22H26O3
InChI: InChI=1/C22H26O3/c1-15(2)10-19-20(22(19,3)4)21(23)25-14-17-12-18(24-13-17)11-16-8-6-5-7-9-16/h5-10,12-13,19-20H,11,14H2,1-4H3
51 atoms
O  1.799058 -2.184186 -0.917325
O  2.491173 -1.846334 1.183466
O  -1.946082 -1.928383 1.264531
C  4.147593 0.533452 -0.067512
C  2.843986 1.017863 0.455646
C  2.872586 -0.178675 -0.490381
C  4.828482 1.31203 -1.167667
C  5.119458 -0.126974 0.878529
C  2.180419 2.269285 0.013278
C  2.406045 -1.469294 0.034408
C  0.853927 2.421767 -0.034546
C  0.227664 3.699305 -0.501091
C  -0.106188 1.331856 0.338325
C  0.968287 -3.282124 -0.496127
C  -0.343963 -2.76021 -0.027619
C  -1.453384 -2.371102 -0.847357
C  -0.704255 -2.462444 1.24305
C  -2.399153 -1.878018 -0.014997
C  -3.742203 -1.284142 -0.245265
C  -3.71418 0.223157 -0.148876
C  -3.911974 0.867122 1.06916
C  -3.447575 0.991383 -1.279222
C  -3.843761 2.252059 1.15549
C  -3.380361 2.375113 -1.196579
C  -3.57595 3.010303 0.023315
H  2.648693 0.73398 1.4871
H  2.557573 0.025382 -1.506992
H  5.420831 2.12742 -0.747845
H  4.120871 1.744889 -1.874717
H  5.5061 0.667665 -1.730133
H  5.709494 -0.888146 0.365232
H  4.634842 -0.593388 1.732711
H  5.81476 0.619479 1.26608
H  2.816175 3.09958 -0.280888
H  -0.409563 4.132152 0.274261
H  0.972636 4.443179 -0.782999
H  -0.417621 3.523255 -1.365816
H  0.356708 0.520163 0.897553
H  -0.924416 1.727884 0.943931
H  -0.563693 0.900421 -0.556455
H  1.466118 -3.881725 0.265218
H  0.847626 -3.898306 -1.384796
H  -1.530742 -2.456902 -1.920114
H  -0.210148 -2.579599 2.194639
H  -4.459003 -1.693253 0.47133
H  -4.075683 -1.586429 -1.238656
H  -4.126495 0.283726 1.957005
H  -3.290816 0.50102 -2.233126
H  -4.00114 2.739323 2.109367
H  -3.175028 2.957687 -2.085667
H  -3.522842 4.089306 0.090262
elementType: O C H
totalener: -1079.73949679 hartree
nucrepener: 2222.58011553 hartree
electener: -3302.31961233 hartree
oneelecener: -5884.77304512 hartree
twoeener: 2582.45343279 hartree
cpcmener: -0.02802919 hartree
kineticenergy: 1074.85896484 hartree
xcener: -106.464413725026 hartree
chargesum: -0.0000000
charge: -0.297014 -0.503224 -0.282398 0.167974 -0.008524 -0.077759 -0.287460 -0.281011 -0.312740 0.372045 0.071212 -0.276261 -0.322557 0.098981 -0.063707 -0.340920 -0.029587 0.198829 -0.049877 0.065102 -0.199909 -0.220517 -0.143691 -0.146443 -0.187631 0.099615 0.088407 0.100110 0.092796 0.097903 0.100650 0.089043 0.094421 0.124707 0.100650 0.100275 0.099679 0.091662 0.108525 0.109926 0.117864 0.120655 0.161183 0.171578 0.114893 0.112361 0.140532 0.141541 0.157795 0.159709 0.160603
qa: -0.2970 -0.5032 -0.2824 0.1680 -0.0085 -0.0778 -0.2875 -0.2810 -0.3127 0.3720 0.0712 -0.2763 -0.3226 0.0990 -0.0637 -0.3409 -0.0296 0.1988 -0.0499 0.0651 -0.1999 -0.2205 -0.1437 -0.1464 -0.1876 0.0996 0.0884 0.1001 0.0928 0.0979 0.1007 0.0890 0.0944 0.1247 0.1006 0.1003 0.0997 0.0917 0.1085 0.1099 0.1179 0.1207 0.1612 0.1716 0.1149 0.1124 0.1405 0.1415 0.1578 0.1597 0.1606
va: 2.0985 1.9865 2.2548 3.6938 3.8070 3.7976 3.9091 3.8851 3.8997 4.1703 3.6185 3.9427 3.9758 3.8067 3.6174 3.9867 3.9145 3.6051 3.8041 3.5435 3.9392 3.8862 3.8571 3.8158 3.8466 1.0285 1.0366 0.9992 1.0010 1.0028 0.9990 1.0198 1.0008 1.0045 0.9944 1.0102 0.9939 1.0188 1.0002 0.9892 1.0143 0.9941 1.0072 1.0041 1.0090 1.0099 1.0084 1.0041 0.9905 0.9909 0.9912
dispcorr: -0.029104833 hartree
energy: -1079.768601627100
dipole: 11.47476 -12.07187 -0.59711 16.10130 -15.69696 0.40435 -3.77466 2.53396 -1.24070
magnitude: 1.43505 au
magnitude: 3.64761 debye
