program: Orca
programVersion: 5.0.2
elementType: O O O C C C C C C C C C C C C C C C C C C C C C C H H H H H H H H H H H H H H H H H H H H H H H H H H
charge: 0
multiplicity: 1
keywords: wb97x-d3
keywords: def2-TZVPP
keywords: def2/J RIJCOSX
keywords: DEFGRID2
keywords: scfconv7
keywords: smallprint printgap noloewdin
keywords: NOSOSCF
formula: C22H26O3
InChI: InChI=1/C22H26O3/c1-15(2)10-19-20(22(19,3)4)21(23)25-14-17-12-18(24-13-17)11-16-8-6-5-7-9-16/h5-10,12-13,19-20H,11,14H2,1-4H3
51 atoms
O  1.492182 -1.695891 0.590909
O  1.57298 -1.275173 -1.606801
O  -2.862086 -2.409295 1.131933
C  2.203363 1.61845 -0.566198
C  3.46636 0.971718 -1.047249
C  2.584082 0.238195 -0.053598
C  2.264389 2.730613 0.452196
C  1.070539 1.793622 -1.548131
C  4.802506 1.429634 -0.622991
C  1.845321 -0.966492 -0.467389
C  5.89454 1.529316 -1.388582
C  7.184691 2.035679 -0.81636
C  5.961065 1.17957 -2.843683
C  0.687091 -2.870095 0.385469
C  -0.76016 -2.532691 0.421061
C  -1.527318 -1.76108 -0.515061
C  -1.626379 -2.890105 1.396429
C  -2.790502 -1.71557 -0.033832
C  -4.028703 -1.045813 -0.505368
C  -4.502159 0.000667 0.47407
C  -5.610937 -0.228554 1.280465
C  -3.808569 1.201611 0.607787
C  -6.024138 0.724125 2.20374
C  -4.218884 2.155019 1.527369
C  -5.32873 1.917865 2.330115
H  3.399729 0.586903 -2.05902
H  2.931616 0.22179 0.973092
H  2.498067 3.680514 -0.032687
H  3.007432 2.560421 1.229544
H  1.296871 2.841801 0.94482
H  1.096631 1.079836 -2.368102
H  1.125649 2.791829 -1.986715
H  0.100994 1.707078 -1.052491
H  4.897184 1.717293 0.419824
H  7.971629 1.281268 -0.894452
H  7.540401 2.90925 -1.36863
H  7.089466 2.316589 0.23215
H  6.162138 2.07052 -3.442091
H  6.787588 0.492357 -3.033419
H  5.055039 0.721058 -3.231102
H  0.93754 -3.536198 1.209848
H  0.96827 -3.368037 -0.542857
H  -1.18595 -1.297551 -1.42657
H  -1.510438 -3.471574 2.298004
H  -4.819049 -1.782463 -0.672288
H  -3.81079 -0.590741 -1.472874
H  -6.158677 -1.158473 1.184472
H  -2.93978 1.389988 -0.012957
H  -6.889416 0.531402 2.824728
H  -3.672307 3.084875 1.618303
H  -5.648817 2.661148 3.048606
elementType: O C H
totalener: -1079.74156553 hartree
nucrepener: 2076.12167733 hartree
electener: -3155.86324286 hartree
oneelecener: -5591.54211378 hartree
twoeener: 2435.67887092 hartree
cpcmener: -0.03031212 hartree
kineticenergy: 1074.86171861 hartree
xcener: -106.463062337306 hartree
chargesum: -0.0000000
charge: -0.288165 -0.505719 -0.287959 0.110531 0.031470 -0.094141 -0.277421 -0.282162 -0.281058 0.432074 -0.051265 -0.218351 -0.253720 0.075395 -0.085978 -0.305004 -0.035914 0.188181 -0.052273 0.029288 -0.179644 -0.194448 -0.164002 -0.171848 -0.167989 0.095706 0.091068 0.097690 0.090743 0.098020 0.092108 0.099565 0.097153 0.120126 0.094503 0.092903 0.088565 0.098493 0.093954 0.090944 0.118324 0.120608 0.163968 0.179139 0.108960 0.118566 0.142074 0.156590 0.159969 0.159647 0.160737
qa: -0.2882 -0.5057 -0.2880 0.1105 0.0315 -0.0941 -0.2774 -0.2822 -0.2811 0.4321 -0.0513 -0.2184 -0.2537 0.0754 -0.0860 -0.3050 -0.0359 0.1882 -0.0523 0.0293 -0.1796 -0.1944 -0.1640 -0.1718 -0.1680 0.0957 0.0911 0.0977 0.0907 0.0980 0.0921 0.0996 0.0972 0.1201 0.0945 0.0929 0.0886 0.0985 0.0940 0.0909 0.1183 0.1206 0.1640 0.1791 0.1090 0.1186 0.1421 0.1566 0.1600 0.1596 0.1607
va: 2.1189 1.9917 2.2669 3.6698 3.7859 3.8317 3.9103 3.9044 3.8767 4.1330 3.7638 3.9190 3.9395 3.8389 3.6899 3.9939 3.9661 3.6764 3.8093 3.5912 3.9391 3.9213 3.8930 3.9131 3.8893 1.0264 1.0354 1.0014 1.0070 1.0008 1.0177 1.0010 0.9989 1.0110 0.9963 0.9956 1.0088 0.9964 0.9972 1.0109 0.9988 1.0088 1.0154 0.9927 1.0061 1.0065 1.0034 0.9951 0.9900 0.9910 0.9892
dispcorr: -0.022469466 hartree
energy: -1079.764034990917
dipole: 24.43076 -24.16548 0.26529 18.17638 -17.71527 0.46111 -7.30175 7.83164 0.52989
magnitude: 0.75086 au
magnitude: 1.90852 debye
