program: Orca
programVersion: 5.0.2
elementType: O O O C C C C C C C C C C C C C C C C C C C C C C H H H H H H H H H H H H H H H H H H H H H H H H H H
charge: 0
multiplicity: 1
keywords: wb97x-d3
keywords: def2-TZVPP
keywords: def2/J RIJCOSX
keywords: DEFGRID2
keywords: scfconv7
keywords: smallprint printgap noloewdin
keywords: NOSOSCF
formula: C22H26O3
InChI: InChI=1/C22H26O3/c1-15(2)10-19-20(22(19,3)4)21(23)25-14-17-12-18(24-13-17)11-16-8-6-5-7-9-16/h5-10,12-13,19-20H,11,14H2,1-4H3
51 atoms
O  1.703544 -2.122063 0.009773
O  1.167701 -1.137429 -1.928696
O  -2.334838 -2.878741 1.413957
C  1.632203 1.349992 0.009246
C  2.641236 1.301826 -1.102906
C  2.399414 0.065962 -0.267743
C  1.961696 2.057117 1.301481
C  0.167859 1.44304 -0.347724
C  3.955462 1.968149 -1.017511
C  1.699808 -1.097845 -0.841359
C  4.568513 2.6543 -1.987707
C  5.92545 3.251293 -1.760449
C  4.011335 2.88572 -3.359295
C  0.876737 -3.265106 -0.285196
C  -0.525635 -2.999518 0.131476
C  -1.537683 -2.25045 -0.555682
C  -1.073543 -3.353208 1.31757
C  -2.609962 -2.203628 0.267904
C  -3.911321 -1.490589 0.184385
C  -3.833181 -0.154694 0.886424
C  -4.040348 -0.057375 2.259786
C  -3.493375 0.992927 0.175331
C  -3.905282 1.162172 2.90985
C  -3.361133 2.214281 0.822293
C  -3.563685 2.301762 2.193124
H  2.198779 1.262228 -2.09213
H  3.14982 -0.178684 0.476358
H  1.32584 1.687164 2.107913
H  1.780305 3.129587 1.206078
H  2.996408 1.919476 1.611939
H  -0.141694 2.489857 -0.361411
H  -0.444852 0.931147 0.397261
H  -0.067521 1.023116 -1.323629
H  4.476515 1.868192 -0.069571
H  6.648547 2.86471 -2.483483
H  5.905394 4.3356 -1.896178
H  6.305804 3.042766 -0.760708
H  2.980247 2.559361 -3.478744
H  4.052645 3.947932 -3.611952
H  4.613573 2.368578 -4.110691
H  1.303481 -4.076731 0.301009
H  0.951355 -3.53455 -1.338493
H  -1.474941 -1.800712 -1.533183
H  -0.700976 -3.925363 2.153144
H  -4.706789 -2.102121 0.616122
H  -4.153532 -1.34355 -0.868544
H  -4.310526 -0.940409 2.826775
H  -3.327139 0.929986 -0.893836
H  -4.068012 1.222848 3.978239
H  -3.098535 3.097615 0.254436
H  -3.458634 3.252398 2.699532
elementType: O C H
totalener: -1079.74034388 hartree
nucrepener: 2149.18001084 hartree
electener: -3228.92035472 hartree
oneelecener: -5737.93076708 hartree
twoeener: 2509.01041237 hartree
cpcmener: -0.02974906 hartree
kineticenergy: 1074.85539148 hartree
xcener: -106.461763183121 hartree
chargesum: -0.0000000
charge: -0.285591 -0.495584 -0.283628 0.133109 0.034882 -0.098880 -0.276753 -0.301000 -0.285712 0.420229 -0.050701 -0.219277 -0.256055 0.071675 -0.057879 -0.364649 -0.039134 0.231573 -0.042568 0.089945 -0.213713 -0.256489 -0.151328 -0.153712 -0.173242 0.089644 0.093533 0.097793 0.098076 0.091692 0.104036 0.094182 0.096614 0.119994 0.092973 0.094039 0.089141 0.091597 0.093979 0.099498 0.120657 0.120542 0.161446 0.179137 0.114516 0.109671 0.143286 0.144313 0.160161 0.163072 0.160891
qa: -0.2856 -0.4956 -0.2836 0.1331 0.0349 -0.0989 -0.2768 -0.3010 -0.2857 0.4202 -0.0507 -0.2193 -0.2561 0.0717 -0.0579 -0.3646 -0.0391 0.2316 -0.0426 0.0899 -0.2137 -0.2565 -0.1513 -0.1537 -0.1732 0.0896 0.0935 0.0978 0.0981 0.0917 0.1040 0.0942 0.0966 0.1200 0.0930 0.0940 0.0891 0.0916 0.0940 0.0995 0.1207 0.1205 0.1614 0.1791 0.1145 0.1097 0.1433 0.1443 0.1602 0.1631 0.1609
va: 2.1182 2.0051 2.2688 3.6763 3.7850 3.8199 3.9006 3.9046 3.8783 4.1725 3.7597 3.9199 3.9401 3.8416 3.6533 3.9702 3.9690 3.6053 3.8040 3.5298 3.9632 3.9100 3.8915 3.8367 3.8949 1.0334 1.0349 1.0018 1.0015 1.0063 1.0016 0.9928 1.0154 1.0108 0.9956 0.9964 1.0088 1.0093 0.9976 0.9956 0.9973 1.0082 1.0186 0.9925 1.0110 1.0105 1.0089 1.0039 0.9894 0.9883 0.9889
dispcorr: -0.025148361 hartree
energy: -1079.765492239600
dipole: 17.34981 -17.17343 0.17638 21.91933 -21.67222 0.24711 -5.59357 6.27681 0.68324
magnitude: 0.74766 au
magnitude: 1.90040 debye
