program: Orca
programVersion: 5.0.2
elementType: O O O C C C C C C C C C C C C C C C C C C C C C C H H H H H H H H H H H H H H H H H H H H H H H H H H
charge: 0
multiplicity: 1
keywords: wb97x-d3
keywords: def2-TZVPP
keywords: def2/J RIJCOSX
keywords: DEFGRID2
keywords: scfconv7
keywords: smallprint printgap noloewdin
keywords: NOSOSCF
formula: C22H26O3
InChI: InChI=1/C22H26O3/c1-15(2)10-19-20(22(19,3)4)21(23)25-14-17-12-18(24-13-17)11-16-8-6-5-7-9-16/h5-10,12-13,19-20H,11,14H2,1-4H3
51 atoms
O  1.521645 -1.400609 0.806006
O  1.592872 -1.535027 -1.425036
O  -2.782523 -1.462618 -0.593199
C  2.713082 1.400434 -0.952614
C  3.791906 0.482409 -1.444873
C  2.953431 0.061752 -0.26773
C  3.101754 2.621914 -0.157808
C  1.488617 1.613638 -1.806781
C  5.232811 0.771858 -1.233268
C  1.972094 -1.029664 -0.392521
C  6.036916 1.338595 -2.136568
C  7.489015 1.569635 -1.850876
C  5.574578 1.784872 -3.489036
C  0.457631 -2.358726 0.860785
C  -0.827193 -1.759477 0.414453
C  -1.383418 -0.508146 0.835502
C  -1.715077 -2.28563 -0.458008
C  -2.567813 -0.377009 0.193253
C  -3.639412 0.65247 0.256156
C  -4.657672 0.333419 1.325923
C  -5.590499 -0.685173 1.139897
C  -4.655187 1.027187 2.531896
C  -6.495299 -1.006415 2.141281
C  -5.562293 0.709934 3.535054
C  -6.483006 -0.310739 3.344246
H  3.550229 -0.024017 -2.375409
H  3.419839 0.137132 0.709082
H  3.367663 3.441401 -0.829292
H  3.953352 2.442173 0.498147
H  2.2683 2.959282 0.461355
H  0.603159 1.783972 -1.189498
H  1.277955 0.781015 -2.475184
H  1.629225 2.49992 -2.428774
H  5.652778 0.49456 -0.270532
H  7.740147 2.630345 -1.930744
H  7.771509 1.228993 -0.855005
H  8.118976 1.04915 -2.577026
H  5.822484 2.837105 -3.64875
H  6.084576 1.226805 -4.27866
H  4.501836 1.670802 -3.637193
H  0.410374 -2.64426 1.911301
H  0.701302 -3.253038 0.28408
H  -0.958327 0.198216 1.531616
H  -1.722435 -3.19448 -1.039172
H  -4.12734 0.737536 -0.717655
H  -3.178076 1.618173 0.465193
H  -5.611999 -1.231861 0.204564
H  -3.938016 1.824242 2.688775
H  -7.212601 -1.801258 1.982029
H  -5.547938 1.261327 4.466435
H  -7.188923 -0.561124 4.125345
elementType: O C H
totalener: -1079.73914711 hartree
nucrepener: 2061.07706547 hartree
electener: -3140.81621258 hartree
oneelecener: -5561.58541220 hartree
twoeener: 2420.76919962 hartree
cpcmener: -0.03166073 hartree
kineticenergy: 1074.85902424 hartree
xcener: -106.461028082581 hartree
chargesum: 0.0000000
charge: -0.288315 -0.493343 -0.284505 0.142914 -0.016826 -0.116169 -0.273949 -0.296148 -0.263035 0.414582 -0.037131 -0.229963 -0.249660 0.103381 -0.054724 -0.366973 -0.047141 0.231274 -0.054519 0.027881 -0.199267 -0.190607 -0.159932 -0.153273 -0.177658 0.098526 0.094714 0.097420 0.092484 0.100291 0.098955 0.093967 0.099740 0.123578 0.094511 0.089389 0.095261 0.096113 0.101091 0.086999 0.120583 0.120655 0.161789 0.179150 0.116088 0.106072 0.141444 0.143343 0.159783 0.160310 0.160851
qa: -0.2883 -0.4933 -0.2845 0.1429 -0.0168 -0.1162 -0.2739 -0.2961 -0.2630 0.4146 -0.0371 -0.2300 -0.2497 0.1034 -0.0547 -0.3670 -0.0471 0.2313 -0.0545 0.0279 -0.1993 -0.1906 -0.1599 -0.1533 -0.1777 0.0985 0.0947 0.0974 0.0925 0.1003 0.0990 0.0940 0.0997 0.1236 0.0945 0.0894 0.0953 0.0961 0.1011 0.0870 0.1206 0.1207 0.1618 0.1791 0.1161 0.1061 0.1414 0.1433 0.1598 0.1603 0.1609
va: 2.1152 2.0072 2.2634 3.6659 3.8029 3.8545 3.9051 3.8971 3.8607 4.1794 3.7011 3.9271 3.9394 3.8233 3.6235 3.9672 3.9607 3.5997 3.7973 3.6258 3.9446 3.9297 3.8985 3.8855 3.8952 1.0247 1.0366 1.0015 1.0021 1.0027 1.0016 1.0164 1.0021 1.0062 0.9965 1.0075 0.9949 0.9979 0.9980 1.0077 0.9885 1.0067 1.0121 0.9930 1.0111 1.0111 1.0129 1.0030 0.9902 0.9898 0.9896
dispcorr: -0.023191875 hartree
energy: -1079.762338985930
dipole: 25.72083 -25.35379 0.36704 17.18005 -16.21218 0.96787 -8.41248 9.23778 0.82529
magnitude: 1.32386 au
magnitude: 3.36499 debye
