program: Orca
programVersion: 5.0.2
elementType: O O O C C C C C C C C C C C C C C C C C C C C C C H H H H H H H H H H H H H H H H H H H H H H H H H H
charge: 0
multiplicity: 1
keywords: wb97x-d3
keywords: def2-TZVPP
keywords: def2/J RIJCOSX
keywords: DEFGRID2
keywords: scfconv7
keywords: smallprint printgap noloewdin
keywords: NOSOSCF
formula: C22H26O3
InChI: InChI=1/C22H26O3/c1-15(2)10-19-20(22(19,3)4)21(23)25-14-17-12-18(24-13-17)11-16-8-6-5-7-9-16/h5-10,12-13,19-20H,11,14H2,1-4H3
51 atoms
O  1.740419 -2.071503 -0.035831
O  1.233285 -1.328266 -2.086223
O  -2.581626 -2.35459 -0.374501
C  1.034185 1.296751 -0.285217
C  2.117077 1.410871 -1.30911
C  2.070865 0.185985 -0.434014
C  1.123879 2.097913 0.989705
C  -0.387189 1.078603 -0.74604
C  3.233125 2.383464 -1.168211
C  1.651688 -1.119402 -0.969426
C  4.504122 2.148784 -1.503929
C  5.561802 3.196809 -1.338864
C  4.984478 0.846465 -2.065893
C  0.96106 -3.266338 -0.232891
C  -0.471011 -2.935722 -0.010983
C  -1.060268 -2.517241 1.226428
C  -1.44261 -2.809517 -0.943818
C  -2.338442 -2.172257 0.949781
C  -3.41416 -1.553523 1.768613
C  -3.38565 -0.048936 1.629824
C  -4.052492 0.586032 0.585751
C  -2.631386 0.721102 2.511077
C  -3.968916 1.963371 0.428025
C  -2.54755 2.098179 2.356968
C  -3.214924 2.723863 1.311891
H  1.781656 1.240119 -2.329951
H  2.791148 0.132912 0.375249
H  0.572505 1.600323 1.789963
H  0.684573 3.088606 0.855139
H  2.150975 2.230829 1.32966
H  -0.953754 0.500826 -0.012393
H  -0.454125 0.567711 -1.704483
H  -0.885608 2.043115 -0.860291
H  2.974535 3.365952 -0.782336
H  5.164863 4.119504 -0.91623
H  6.362566 2.841487 -0.685222
H  6.030392 3.43624 -2.296707
H  4.18951 0.116303 -2.2052
H  5.466386 1.004174 -3.034031
H  5.742394 0.401365 -1.416044
H  1.333724 -3.9652 0.513587
H  1.13445 -3.698562 -1.218616
H  -0.58206 -2.46937 2.192463
H  -1.471131 -3.00341 -2.004587
H  -3.256031 -1.834317 2.810346
H  -4.389375 -1.946599 1.473201
H  -4.64547 0.002235 -0.108339
H  -2.10511 0.238534 3.326458
H  -4.49467 2.443418 -0.387332
H  -1.961376 2.682561 3.054564
H  -3.15101 3.797274 1.18974
elementType: O C H
totalener: -1079.73816819 hartree
nucrepener: 2215.41019994 hartree
electener: -3295.14836813 hartree
oneelecener: -5870.51464575 hartree
twoeener: 2575.36627762 hartree
cpcmener: -0.02926539 hartree
kineticenergy: 1074.85992737 hartree
xcener: -106.463667762737 hartree
chargesum: -0.0000000
charge: -0.293435 -0.488419 -0.280447 0.234773 -0.017431 -0.131455 -0.317166 -0.284147 -0.310759 0.387628 -0.018759 -0.230099 -0.237845 0.097957 -0.055473 -0.340496 -0.036757 0.199720 -0.052465 0.046938 -0.187066 -0.179797 -0.164752 -0.181221 -0.164076 0.105088 0.099860 0.096399 0.101648 0.103377 0.042349 0.101717 0.108521 0.124682 0.089848 0.094663 0.096543 0.079838 0.101927 0.098673 0.122433 0.117110 0.160540 0.175813 0.110296 0.113662 0.139685 0.141077 0.158657 0.161123 0.159521
qa: -0.2934 -0.4884 -0.2804 0.2348 -0.0174 -0.1315 -0.3172 -0.2841 -0.3108 0.3876 -0.0188 -0.2301 -0.2378 0.0980 -0.0555 -0.3405 -0.0368 0.1997 -0.0525 0.0469 -0.1871 -0.1798 -0.1648 -0.1812 -0.1641 0.1051 0.0999 0.0964 0.1016 0.1034 0.0423 0.1017 0.1085 0.1247 0.0898 0.0947 0.0965 0.0798 0.1019 0.0987 0.1224 0.1171 0.1605 0.1758 0.1103 0.1137 0.1397 0.1411 0.1587 0.1611 0.1595
va: 2.0954 2.0044 2.2566 3.5761 3.8288 3.8214 3.9073 3.8914 3.8934 4.1898 3.7096 3.9298 3.9310 3.8283 3.6314 3.9686 3.9332 3.6088 3.8119 3.5764 3.9165 3.8641 3.8828 3.8545 3.8417 1.0230 1.0302 1.0032 0.9989 1.0046 1.0085 1.0248 1.0005 1.0026 1.0061 0.9968 0.9960 1.0160 0.9992 0.9989 0.9930 1.0103 1.0092 0.9989 1.0109 1.0120 1.0089 1.0039 0.9906 0.9893 0.9905
dispcorr: -0.028761129 hartree
energy: -1079.766929316132
dipole: 16.60621 -16.36980 0.23641 17.47258 -17.27976 0.19281 -0.44742 1.80686 1.35943
magnitude: 1.39324 au
magnitude: 3.54134 debye
