program: Orca
programVersion: 5.0.2
elementType: O O O C C C C C C C C C C C C C C C C C C C C C C H H H H H H H H H H H H H H H H H H H H H H H H H H
charge: 0
multiplicity: 1
keywords: wb97x-d3
keywords: def2-TZVPP
keywords: def2/J RIJCOSX
keywords: DEFGRID2
keywords: scfconv7
keywords: smallprint printgap noloewdin
keywords: NOSOSCF
formula: C22H26O3
InChI: InChI=1/C22H26O3/c1-15(2)10-19-20(22(19,3)4)21(23)25-14-17-12-18(24-13-17)11-16-8-6-5-7-9-16/h5-10,12-13,19-20H,11,14H2,1-4H3
51 atoms
O  1.605772 -2.175804 -0.632784
O  2.101868 -1.207424 1.321558
O  -2.274499 -2.057004 1.501954
C  4.237089 0.222551 -0.550982
C  3.14692 1.161578 -0.132628
C  2.783365 -0.183117 -0.732551
C  5.007874 0.484374 -1.821692
C  5.078858 -0.419874 0.523642
C  2.812468 2.393135 -0.873726
C  2.144557 -1.209874 0.111027
C  2.516681 3.58453 -0.34231
C  2.174813 4.752297 -1.219027
C  2.484342 3.885472 1.125406
C  0.876982 -3.219016 0.039097
C  -0.501846 -2.779045 0.376439
C  -1.606438 -2.641515 -0.527024
C  -0.970778 -2.405441 1.589347
C  -2.656279 -2.206363 0.205923
C  -4.055902 -1.852761 -0.140966
C  -4.312985 -0.370512 -0.013597
C  -4.986188 0.147628 1.08736
C  -3.850331 0.506111 -0.992274
C  -5.19986 1.515667 1.206351
C  -4.063654 1.871703 -0.877619
C  -4.740558 2.381427 0.224078
H  3.006229 1.209953 0.941562
H  2.442374 -0.174981 -1.762073
H  4.385669 0.879226 -2.623486
H  5.464398 -0.438002 -2.185252
H  5.812101 1.199891 -1.639563
H  5.415168 -1.412005 0.215828
H  4.560226 -0.519289 1.474667
H  5.969081 0.186189 0.70147
H  2.794504 2.308315 -1.956431
H  1.1914 5.156804 -0.966072
H  2.888133 5.56873 -1.079522
H  2.168315 4.487541 -2.276113
H  3.107503 4.754062 1.350445
H  1.470892 4.145764 1.441344
H  2.825296 3.065228 1.753254
H  1.416655 -3.558999 0.922936
H  0.854767 -4.039255 -0.676374
H  -1.612096 -2.849682 -1.585627
H  -0.517095 -2.350864 2.566557
H  -4.752679 -2.406567 0.493501
H  -4.233534 -2.17847 -1.166935
H  -5.352701 -0.522929 1.85557
H  -3.321639 0.114162 -1.85362
H  -5.727933 1.903768 2.067846
H  -3.703706 2.53931 -1.649876
H  -4.909791 3.446552 0.313932
elementType: O C H
totalener: -1079.74189704 hartree
nucrepener: 2086.98035679 hartree
electener: -3166.72225384 hartree
oneelecener: -5613.73802203 hartree
twoeener: 2447.01576819 hartree
cpcmener: -0.03155204 hartree
kineticenergy: 1074.85344931 hartree
xcener: -106.460711870083 hartree
chargesum: -0.0000000
charge: -0.290243 -0.505349 -0.286684 0.098351 0.040518 -0.099615 -0.271977 -0.272452 -0.285415 0.425822 -0.048299 -0.219380 -0.254888 0.094215 -0.087128 -0.334153 -0.016000 0.195305 -0.051855 0.044272 -0.195550 -0.199156 -0.159424 -0.163238 -0.174742 0.087948 0.090536 0.089933 0.097469 0.097680 0.099282 0.089748 0.096718 0.122045 0.093084 0.094673 0.088712 0.094535 0.098717 0.091466 0.120204 0.124138 0.163982 0.175531 0.110860 0.117527 0.143105 0.146332 0.160323 0.161127 0.161390
qa: -0.2902 -0.5053 -0.2867 0.0984 0.0405 -0.0996 -0.2720 -0.2725 -0.2854 0.4258 -0.0483 -0.2194 -0.2549 0.0942 -0.0871 -0.3342 -0.0160 0.1953 -0.0519 0.0443 -0.1955 -0.1992 -0.1594 -0.1632 -0.1747 0.0879 0.0905 0.0899 0.0975 0.0977 0.0993 0.0897 0.0967 0.1220 0.0931 0.0947 0.0887 0.0945 0.0987 0.0915 0.1202 0.1241 0.1640 0.1755 0.1109 0.1175 0.1431 0.1463 0.1603 0.1611 0.1614
va: 2.1191 1.9949 2.2688 3.6995 3.7642 3.8275 3.9108 3.9038 3.8802 4.1555 3.7595 3.9199 3.9409 3.8028 3.6221 4.0112 3.9457 3.6345 3.8117 3.5822 3.9471 3.9355 3.8893 3.8985 3.8925 1.0363 1.0355 1.0060 1.0016 1.0015 0.9996 1.0184 1.0001 1.0102 0.9959 0.9960 1.0088 0.9975 0.9961 1.0092 1.0118 0.9937 1.0065 1.0001 1.0071 1.0069 1.0044 1.0022 0.9898 0.9900 0.9893
dispcorr: -0.021732234 hartree
energy: -1079.763629278701
dipole: 20.28632 -20.26271 0.02361 19.08416 -19.14359 -0.05943 -5.59867 4.39105 -1.20761
magnitude: 1.20931 au
magnitude: 3.07381 debye
