program: Orca
programVersion: 5.0.2
elementType: O O O C C C C C C C C C C C C C C C C C C C C C C H H H H H H H H H H H H H H H H H H H H H H H H H H
charge: 0
multiplicity: 1
keywords: wb97x-d3
keywords: def2-TZVPP
keywords: def2/J RIJCOSX
keywords: DEFGRID2
keywords: scfconv7
keywords: smallprint printgap noloewdin
keywords: NOSOSCF
formula: C22H26O3
InChI: InChI=1/C22H26O3/c1-15(2)10-19-20(22(19,3)4)21(23)25-14-17-12-18(24-13-17)11-16-8-6-5-7-9-16/h5-10,12-13,19-20H,11,14H2,1-4H3
51 atoms
O  1.914492 -2.244989 -0.801404
O  1.957082 -1.711437 1.370985
O  -2.306137 -2.031889 -1.023222
C  3.573687 0.814225 0.495618
C  2.123833 1.138567 0.381933
C  2.667889 -0.124259 -0.277195
C  4.553223 1.58009 -0.362092
C  4.145873 0.429366 1.837754
C  1.615166 2.253399 -0.457471
C  2.169533 -1.417189 0.215001
C  0.580349 2.176203 -1.298856
C  0.142339 3.361361 -2.102938
C  -0.212826 0.923756 -1.522606
C  1.05664 -3.377883 -0.554761
C  -0.348982 -2.903894 -0.436336
C  -1.044558 -2.478564 0.742291
C  -1.1698 -2.609205 -1.472139
C  -2.220284 -1.951177 0.330572
C  -3.296267 -1.21816 1.045088
C  -3.101865 0.27496 0.905266
C  -2.073122 0.910211 1.598966
C  -3.900048 1.028189 0.052435
C  -1.849528 2.269847 1.446506
C  -3.679135 2.392287 -0.102677
C  -2.653649 3.016806 0.592592
H  1.547987 0.94187 1.284976
H  2.769301 -0.071545 -1.35487
H  4.834802 2.518208 0.120038
H  4.14952 1.819249 -1.345999
H  5.465085 0.999117 -0.511352
H  3.410345 -0.002173 2.511546
H  4.551285 1.318297 2.324769
H  4.965026 -0.283372 1.726646
H  2.127939 3.20619 -0.353047
H  0.774006 4.232898 -1.932899
H  0.158202 3.134638 -3.172137
H  -0.888134 3.635904 -1.861975
H  -1.2784 1.15273 -1.591641
H  0.063674 0.452488 -2.470048
H  -0.081009 0.188109 -0.732366
H  1.382169 -3.934097 0.324043
H  1.187037 -4.015803 -1.426551
H  -0.706399 -2.54743 1.763606
H  -1.079861 -2.746236 -2.538729
H  -3.258888 -1.50341 2.097486
H  -4.278939 -1.508679 0.66756
H  -1.438045 0.333161 2.261759
H  -4.702068 0.547709 -0.495242
H  -1.046534 2.747921 1.992761
H  -4.309767 2.965926 -0.769721
H  -2.480714 4.078341 0.471704
elementType: O C H
totalener: -1079.73746010 hartree
nucrepener: 2280.91642967 hartree
electener: -3360.65388977 hartree
oneelecener: -6001.58854690 hartree
twoeener: 2640.93465713 hartree
cpcmener: -0.02777042 hartree
kineticenergy: 1074.86126997 hartree
xcener: -106.465437118831 hartree
chargesum: 0.0000000
charge: -0.294056 -0.499745 -0.278837 0.159898 0.002207 -0.092536 -0.286983 -0.289975 -0.306409 0.384615 -0.017700 -0.225360 -0.211603 0.079048 -0.072070 -0.292170 -0.051943 0.185271 -0.045208 0.055919 -0.213392 -0.198014 -0.140844 -0.128751 -0.212013 0.100594 0.093683 0.099446 0.093090 0.098652 0.090590 0.094193 0.100661 0.122032 0.090973 0.101532 0.091730 0.101817 0.125456 0.020631 0.118017 0.123929 0.160242 0.177413 0.116338 0.107700 0.141062 0.140800 0.158618 0.158291 0.163161
qa: -0.2941 -0.4997 -0.2788 0.1599 0.0022 -0.0925 -0.2870 -0.2900 -0.3064 0.3846 -0.0177 -0.2254 -0.2116 0.0790 -0.0721 -0.2922 -0.0519 0.1853 -0.0452 0.0559 -0.2134 -0.1980 -0.1408 -0.1288 -0.2120 0.1006 0.0937 0.0994 0.0931 0.0987 0.0906 0.0942 0.1007 0.1220 0.0910 0.1015 0.0917 0.1018 0.1255 0.0206 0.1180 0.1239 0.1602 0.1774 0.1163 0.1077 0.1411 0.1408 0.1586 0.1583 0.1632
va: 2.1023 1.9934 2.2521 3.7170 3.7779 3.8153 3.9057 3.8823 3.8541 4.1570 3.7221 3.9247 3.9105 3.8430 3.6376 3.9604 3.9210 3.6460 3.8146 3.5587 3.8674 3.9414 3.8137 3.8455 3.8525 1.0228 1.0316 1.0004 1.0025 1.0027 1.0210 1.0006 0.9987 1.0050 1.0067 0.9961 0.9970 1.0013 1.0035 1.0144 1.0086 0.9962 1.0153 0.9931 1.0081 1.0133 1.0062 1.0046 0.9915 0.9898 0.9889
dispcorr: -0.031319812 hartree
energy: -1079.768779910101
dipole: 10.99266 -11.17066 -0.17800 16.48449 -16.12856 0.35593 -3.00387 2.10805 -0.89582
magnitude: 0.98023 au
magnitude: 2.49155 debye
