program: Orca
programVersion: 5.0.2
elementType: O O O C C C C C C C C C C C C C C C C C C C C C C H H H H H H H H H H H H H H H H H H H H H H H H H H
charge: 0
multiplicity: 1
keywords: wb97x-d3
keywords: def2-TZVPP
keywords: def2/J RIJCOSX
keywords: DEFGRID2
keywords: scfconv7
keywords: smallprint printgap noloewdin
keywords: NOSOSCF
formula: C22H26O3
InChI: InChI=1/C22H26O3/c1-15(2)10-19-20(22(19,3)4)21(23)25-14-17-12-18(24-13-17)11-16-8-6-5-7-9-16/h5-10,12-13,19-20H,11,14H2,1-4H3
51 atoms
O  1.705799 -2.244281 -0.159555
O  1.019512 -1.215162 -2.027718
O  -2.151966 -3.309229 1.575613
C  1.513275 1.25196 -0.098824
C  2.529236 1.223759 -1.203019
C  2.296482 -0.022225 -0.391961
C  1.855128 1.952091 1.192556
C  0.050935 1.352725 -0.459008
C  3.838865 1.914551 -1.094782
C  1.612614 -1.191532 -0.971549
C  4.121202 3.10543 -1.629653
C  5.485952 3.711432 -1.507925
C  3.126576 3.923931 -2.393735
C  0.899113 -3.405132 -0.434326
C  -0.459577 -3.21818 0.140609
C  -1.514674 -2.367045 -0.325174
C  -0.908886 -3.760582 1.296499
C  -2.512015 -2.452619 0.585903
C  -3.811123 -1.735156 0.718465
C  -3.587388 -0.268056 0.999327
C  -3.102857 0.147794 2.238293
C  -3.81257 0.686572 0.013362
C  -2.847732 1.489057 2.483594
C  -3.560388 2.031591 0.257223
C  -3.075237 2.436621 1.492125
H  2.094972 1.203288 -2.198575
H  3.049213 -0.263512 0.351296
H  1.222201 1.588993 2.004413
H  1.685951 3.026805 1.09822
H  2.893365 1.804384 1.488097
H  -0.252007 2.401556 -0.456743
H  -0.571221 0.830865 0.272202
H  -0.177297 0.953435 -1.44487
H  4.620972 1.397672 -0.5458
H  6.176186 3.066139 -0.96497
H  5.914841 3.910195 -2.49354
H  5.443213 4.673901 -0.991813
H  2.115027 3.523095 -2.350079
H  3.096771 4.946048 -2.009028
H  3.412666 4.000959 -3.446178
H  1.411652 -4.229899 0.057142
H  0.8735 -3.614583 -1.503473
H  -1.526201 -1.756159 -1.213278
H  -0.472929 -4.457362 1.995657
H  -4.398784 -2.190525 1.517908
H  -4.387148 -1.849057 -0.201288
H  -2.922141 -0.584162 3.017165
H  -4.187548 0.376518 -0.954838
H  -2.472391 1.796403 3.451285
H  -3.74078 2.761561 -0.521342
H  -2.877396 3.483246 1.683584
elementType: O C H
totalener: -1079.73857298 hartree
nucrepener: 2172.88032306 hartree
electener: -3252.61889604 hartree
oneelecener: -5785.34702115 hartree
twoeener: 2532.72812510 hartree
cpcmener: -0.02898616 hartree
kineticenergy: 1074.84875112 hartree
xcener: -106.459832449926 hartree
chargesum: 0.0000000
charge: -0.286509 -0.495988 -0.281028 0.200516 -0.013205 -0.135231 -0.276002 -0.326341 -0.270635 0.427634 -0.035296 -0.228902 -0.252419 0.075571 -0.078005 -0.344144 -0.036176 0.233798 -0.034895 -0.007241 -0.174178 -0.168110 -0.159059 -0.167001 -0.174849 0.099942 0.094487 0.097298 0.097437 0.094579 0.104667 0.070515 0.102979 0.122987 0.089339 0.094915 0.095120 0.087826 0.094946 0.102248 0.118152 0.120359 0.162339 0.179880 0.110192 0.106298 0.142300 0.141088 0.159313 0.158938 0.159551
qa: -0.2865 -0.4960 -0.2810 0.2005 -0.0132 -0.1352 -0.2760 -0.3263 -0.2706 0.4276 -0.0353 -0.2289 -0.2524 0.0756 -0.0780 -0.3441 -0.0362 0.2338 -0.0349 -0.0072 -0.1742 -0.1681 -0.1591 -0.1670 -0.1748 0.0999 0.0945 0.0973 0.0974 0.0946 0.1047 0.0705 0.1030 0.1230 0.0893 0.0949 0.0951 0.0878 0.0949 0.1022 0.1182 0.1204 0.1623 0.1799 0.1102 0.1063 0.1423 0.1411 0.1593 0.1589 0.1596
va: 2.1164 2.0045 2.2730 3.6089 3.8008 3.8898 3.9016 3.9044 3.8659 4.1685 3.6991 3.9265 3.9408 3.8376 3.6991 3.9474 3.9562 3.6219 3.7957 3.6608 3.8972 3.8755 3.8695 3.8592 3.8498 1.0230 1.0377 1.0035 1.0016 1.0033 1.0005 1.0032 1.0178 1.0068 1.0078 0.9946 0.9964 1.0072 0.9985 0.9975 0.9976 1.0093 1.0167 0.9923 1.0148 1.0075 1.0085 1.0030 0.9904 0.9912 0.9905
dispcorr: -0.026588024 hartree
energy: -1079.765161009095
dipole: 14.82957 -14.69733 0.13224 25.00812 -24.58099 0.42713 -3.86204 4.67059 0.80855
magnitude: 0.92394 au
magnitude: 2.34848 debye
