program: Orca
programVersion: 5.0.2
elementType: O O O C C C C C C C C C C C C C C C C C C C C C C H H H H H H H H H H H H H H H H H H H H H H H H H H
charge: 0
multiplicity: 1
keywords: wb97x-d3
keywords: def2-TZVPP
keywords: def2/J RIJCOSX
keywords: DEFGRID2
keywords: scfconv7
keywords: smallprint printgap noloewdin
keywords: NOSOSCF
formula: C22H26O3
InChI: InChI=1/C22H26O3/c1-15(2)10-19-20(22(19,3)4)21(23)25-14-17-12-18(24-13-17)11-16-8-6-5-7-9-16/h5-10,12-13,19-20H,11,14H2,1-4H3
51 atoms
O  1.858257 -2.331937 -0.719073
O  1.87089 -1.322966 1.275518
O  -2.325268 -2.337949 0.943369
C  4.188654 0.377293 0.059579
C  2.909699 1.125076 -0.117773
C  3.006577 -0.326987 -0.583151
C  5.351499 0.646141 -0.866552
C  4.634853 0.030894 1.459256
C  2.734439 2.209838 -1.10427
C  2.202828 -1.345261 0.111099
C  1.682798 3.03223 -1.180689
C  1.644094 4.140556 -2.188382
C  0.473201 2.94965 -0.299505
C  0.994632 -3.361853 -0.21468
C  -0.38775 -2.856874 -0.007462
C  -1.21814 -2.195953 -0.970213
C  -1.111406 -2.90532 1.132916
C  -2.378999 -1.900971 -0.341413
C  -3.608647 -1.189043 -0.768568
C  -3.839183 0.084489 0.010472
C  -5.021281 0.284264 0.713839
C  -2.866523 1.08265 0.034491
C  -5.234468 1.459579 1.424593
C  -3.074502 2.254626 0.745573
C  -4.26123 2.447796 1.443145
H  2.338337 1.237478 0.797761
H  3.09364 -0.475658 -1.653223
H  5.04867 0.789022 -1.903073
H  6.04865 -0.193091 -0.844514
H  5.897772 1.536962 -0.551261
H  5.163636 -0.923899 1.479116
H  3.817016 -0.018509 2.173731
H  5.329412 0.795125 1.813234
H  3.541799 2.357355 -1.815022
H  1.522211 5.10979 -1.697658
H  2.550053 4.181226 -2.792526
H  0.791069 4.028322 -2.862293
H  0.423724 3.808563 0.375336
H  -0.435787 2.982967 -0.904502
H  0.431947 2.046597 0.306403
H  1.398405 -3.795248 0.70175
H  1.019932 -4.130572 -0.985794
H  -0.975729 -1.965637 -1.995928
H  -0.904913 -3.299795 2.115736
H  -4.480294 -1.841298 -0.669376
H  -3.506304 -0.9657 -1.832458
H  -5.783683 -0.48578 0.706777
H  -1.937535 0.940982 -0.50679
H  -6.160501 1.598373 1.967581
H  -2.309831 3.02139 0.753828
H  -4.423196 3.362121 1.998978
elementType: O C H
totalener: -1079.74051457 hartree
nucrepener: 2147.93874871 hartree
electener: -3227.67926328 hartree
oneelecener: -5735.49674584 hartree
twoeener: 2507.81748256 hartree
cpcmener: -0.03199782 hartree
kineticenergy: 1074.86534364 hartree
xcener: -106.464984404097 hartree
chargesum: -0.0000000
charge: -0.295089 -0.505118 -0.288207 0.129384 -0.027780 -0.060395 -0.295950 -0.277704 -0.262744 0.412290 -0.008374 -0.230616 -0.293646 0.104978 -0.057920 -0.353455 -0.040377 0.207205 -0.049408 -0.007099 -0.172999 -0.175197 -0.158557 -0.165374 -0.178058 0.101330 0.091616 0.090534 0.099474 0.103758 0.099632 0.091556 0.095596 0.121035 0.094295 0.089282 0.095260 0.108912 0.096021 0.091096 0.118806 0.121596 0.160631 0.178864 0.104659 0.116175 0.143268 0.155204 0.159652 0.161360 0.160599
qa: -0.2951 -0.5051 -0.2882 0.1294 -0.0278 -0.0604 -0.2959 -0.2777 -0.2627 0.4123 -0.0084 -0.2306 -0.2936 0.1050 -0.0579 -0.3535 -0.0404 0.2072 -0.0494 -0.0071 -0.1730 -0.1752 -0.1586 -0.1654 -0.1781 0.1013 0.0916 0.0905 0.0995 0.1038 0.0996 0.0916 0.0956 0.1210 0.0943 0.0893 0.0953 0.1089 0.0960 0.0911 0.1188 0.1216 0.1606 0.1789 0.1047 0.1162 0.1433 0.1552 0.1597 0.1614 0.1606
va: 2.1149 1.9942 2.2610 3.7375 3.8199 3.8034 3.9211 3.8880 3.9087 4.1263 3.7304 3.9247 3.9456 3.8254 3.6121 3.9849 3.9596 3.6167 3.8242 3.7280 3.9166 3.9448 3.8937 3.8870 3.9349 1.0189 1.0339 1.0034 1.0009 0.9991 0.9992 1.0200 1.0000 1.0074 0.9944 1.0080 0.9969 0.9946 0.9902 1.0040 1.0066 0.9887 1.0101 0.9944 1.0084 1.0043 1.0022 0.9880 0.9898 0.9925 0.9910
dispcorr: -0.024160092 hartree
energy: -1079.764674662229
dipole: 16.29896 -16.11515 0.18381 18.64289 -18.48663 0.15626 -5.44308 4.15340 -1.28968
magnitude: 1.31205 au
magnitude: 3.33496 debye
