program: Orca
programVersion: 5.0.2
elementType: O O O C C C C C C C C C C C C C C C C C C C C C C H H H H H H H H H H H H H H H H H H H H H H H H H H
charge: 0
multiplicity: 1
keywords: wb97x-d3
keywords: def2-TZVPP
keywords: def2/J RIJCOSX
keywords: DEFGRID2
keywords: scfconv7
keywords: smallprint printgap noloewdin
keywords: NOSOSCF
formula: C22H26O3
InChI: InChI=1/C22H26O3/c1-15(2)10-19-20(22(19,3)4)21(23)25-14-17-12-18(24-13-17)11-16-8-6-5-7-9-16/h5-10,12-13,19-20H,11,14H2,1-4H3
51 atoms
O  1.473013 -1.832864 0.33969
O  1.440728 -1.220307 -1.814037
O  -2.820603 -2.515918 1.122673
C  2.069544 1.581159 -0.538619
C  3.308757 1.010692 -1.159526
C  2.507459 0.168683 -0.183409
C  2.18648 2.600821 0.568888
C  0.863271 1.815425 -1.415504
C  4.660927 1.459833 -0.77741
C  1.762776 -1.007087 -0.665607
C  5.707246 1.638839 -1.591037
C  7.017419 2.130089 -1.051149
C  5.699073 1.402273 -3.070345
C  0.650937 -2.984313 0.075532
C  -0.786259 -2.642732 0.238981
C  -1.604829 -1.802652 -0.587747
C  -1.581785 -3.039603 1.258521
C  -2.824091 -1.757167 -0.003876
C  -4.068881 -1.012339 -0.31842
C  -4.356515 0.03585 0.730493
C  -5.372747 -0.144864 1.662426
C  -3.572772 1.185832 0.803276
C  -5.606238 0.80592 2.648976
C  -3.804208 2.137183 1.785527
C  -4.822507 1.949039 2.713365
H  3.183408 0.717705 -2.196191
H  2.920729 0.06131 0.813302
H  2.982093 2.37445 1.276894
H  1.253469 2.654156 1.13302
H  2.37794 3.592856 0.155004
H  0.863282 2.850748 -1.76136
H  -0.063618 1.658227 -0.858631
H  0.838764 1.181029 -2.298322
H  4.810039 1.667943 0.278019
H  7.812401 1.400484 -1.226012
H  7.327078 3.049027 -1.555883
H  6.973942 2.332173 0.018891
H  5.789266 2.349936 -3.610916
H  6.56185 0.798406 -3.365253
H  4.803315 0.900489 -3.434327
H  0.950029 -3.726588 0.813875
H  0.866274 -3.389287 -0.913144
H  -1.321778 -1.294169 -1.495304
H  -1.409264 -3.675837 2.112816
H  -4.915506 -1.698697 -0.401107
H  -3.939462 -0.546203 -1.296397
H  -5.988148 -1.03548 1.616889
H  -2.772617 1.335023 0.086365
H  -6.401231 0.650827 3.366978
H  -3.189645 3.027158 1.828438
H  -5.003204 2.690258 3.480889
elementType: O C H
totalener: -1079.74140840 hartree
nucrepener: 2088.08154482 hartree
electener: -3167.82295322 hartree
oneelecener: -5615.44589885 hartree
twoeener: 2447.62294563 hartree
cpcmener: -0.03027075 hartree
kineticenergy: 1074.84121432 hartree
xcener: -106.458959829486 hartree
chargesum: -0.0000000
charge: -0.287892 -0.504480 -0.286923 0.111662 0.032966 -0.092836 -0.278144 -0.282138 -0.284575 0.429102 -0.049458 -0.218181 -0.256153 0.076433 -0.084210 -0.311127 -0.034995 0.193566 -0.053842 0.024172 -0.177152 -0.187598 -0.165278 -0.179130 -0.165226 0.096155 0.091734 0.090950 0.097741 0.098145 0.099782 0.094320 0.092296 0.120682 0.094204 0.092790 0.088353 0.100103 0.093441 0.091732 0.118582 0.120031 0.164425 0.179157 0.109376 0.117797 0.142269 0.157113 0.159780 0.159694 0.160784
qa: -0.2879 -0.5045 -0.2869 0.1117 0.0330 -0.0928 -0.2781 -0.2821 -0.2846 0.4291 -0.0495 -0.2182 -0.2562 0.0764 -0.0842 -0.3111 -0.0350 0.1936 -0.0538 0.0242 -0.1772 -0.1876 -0.1653 -0.1791 -0.1652 0.0962 0.0917 0.0909 0.0977 0.0981 0.0998 0.0943 0.0923 0.1207 0.0942 0.0928 0.0884 0.1001 0.0934 0.0917 0.1186 0.1200 0.1644 0.1792 0.1094 0.1178 0.1423 0.1571 0.1598 0.1597 0.1608
va: 2.1190 1.9937 2.2673 3.6701 3.7878 3.8291 3.9107 3.9069 3.8787 4.1411 3.7592 3.9199 3.9383 3.8364 3.6908 3.9887 3.9666 3.6664 3.8136 3.6002 3.9348 3.9165 3.8939 3.9215 3.8881 1.0259 1.0351 1.0071 1.0009 1.0010 1.0014 0.9986 1.0178 1.0104 0.9965 0.9953 1.0089 0.9955 0.9974 1.0103 0.9984 1.0101 1.0151 0.9928 1.0075 1.0071 1.0035 0.9929 0.9899 0.9913 0.9892
dispcorr: -0.022807876 hartree
energy: -1079.764216279263
dipole: 23.50224 -23.24970 0.25253 18.79820 -18.37164 0.42656 -7.00431 7.57772 0.57341
magnitude: 0.75797 au
magnitude: 1.92661 debye
