program: Orca
programVersion: 5.0.2
elementType: O O O C C C C C C C C C C C C C C C C C C C C C C H H H H H H H H H H H H H H H H H H H H H H H H H H
charge: 0
multiplicity: 1
keywords: wb97x-d3
keywords: def2-TZVPP
keywords: def2/J RIJCOSX
keywords: DEFGRID2
keywords: scfconv7
keywords: smallprint printgap noloewdin
keywords: NOSOSCF
formula: C22H26O3
InChI: InChI=1/C22H26O3/c1-15(2)10-19-20(22(19,3)4)21(23)25-14-17-12-18(24-13-17)11-16-8-6-5-7-9-16/h5-10,12-13,19-20H,11,14H2,1-4H3
51 atoms
O  1.158988 -1.506042 -1.249046
O  0.79442 0.655916 -1.700698
O  -2.263588 -2.243517 1.47311
C  3.413053 0.956089 0.037337
C  3.748492 1.127655 -1.412838
C  2.956792 -0.081694 -0.977949
C  4.491592 0.501072 0.988601
C  2.428662 1.911994 0.662799
C  5.123098 0.931973 -1.935183
C  1.539201 -0.232318 -1.349477
C  5.965525 1.914242 -2.265696
C  7.331567 1.616779 -2.804151
C  5.638548 3.369764 -2.130652
C  -0.211294 -1.844961 -1.523323
C  -1.060324 -1.697154 -0.312135
C  -1.538396 -0.498915 0.31526
C  -1.532534 -2.717577 0.441124
C  -2.259362 -0.888023 1.392118
C  -3.053647 -0.138804 2.399947
C  -4.531095 -0.187882 2.091968
C  -5.131203 0.836485 1.365448
C  -5.3076 -1.271864 2.492585
C  -6.481047 0.781428 1.045691
C  -6.656836 -1.331542 2.170526
C  -7.247809 -0.305018 1.445346
H  3.16193 1.894058 -1.911067
H  3.50544 -1.016481 -0.93583
H  4.050701 0.056876 1.882759
H  5.102862 1.347632 1.307495
H  5.155985 -0.239359 0.544416
H  1.859603 1.430597 1.460698
H  1.722634 2.329758 -0.051376
H  2.972015 2.748644 1.106337
H  5.45848 -0.09463 -2.052816
H  7.509379 0.546468 -2.9063
H  7.476784 2.078646 -3.784172
H  8.106803 2.028183 -2.152533
H  6.412469 3.880521 -1.55226
H  5.615651 3.856841 -3.108968
H  4.684136 3.555208 -1.640614
H  -0.184554 -2.887467 -1.835548
H  -0.589225 -1.255784 -2.358995
H  -1.377042 0.519331 0.000537
H  -1.430339 -3.789018 0.363173
H  -2.708142 0.895338 2.399563
H  -2.863307 -0.539781 3.398667
H  -4.537136 1.686263 1.049837
H  -4.857077 -2.073918 3.065298
H  -6.934102 1.588633 0.484606
H  -7.24804 -2.180673 2.488606
H  -8.299859 -0.350328 1.195734
elementType: O C H
totalener: -1079.74018738 hartree
nucrepener: 2039.97047625 hartree
electener: -3119.71066363 hartree
oneelecener: -5519.35901408 hartree
twoeener: 2399.64835045 hartree
cpcmener: -0.02950713 hartree
kineticenergy: 1074.86225843 hartree
xcener: -106.460929866411 hartree
chargesum: -0.0000000
charge: -0.288469 -0.504630 -0.286758 0.155426 -0.003094 -0.136947 -0.266964 -0.302295 -0.272795 0.443412 -0.033485 -0.229568 -0.252685 0.074396 -0.085862 -0.312354 -0.037368 0.210567 -0.057072 0.054977 -0.204557 -0.206057 -0.150922 -0.157359 -0.181491 0.098571 0.092077 0.099119 0.095955 0.092281 0.100843 0.093210 0.098347 0.123788 0.089779 0.094619 0.095000 0.094982 0.100662 0.088578 0.118044 0.120485 0.162745 0.178798 0.107814 0.117701 0.144177 0.142300 0.160720 0.160218 0.161139
qa: -0.2885 -0.5046 -0.2868 0.1554 -0.0031 -0.1369 -0.2670 -0.3023 -0.2728 0.4434 -0.0335 -0.2296 -0.2527 0.0744 -0.0859 -0.3124 -0.0374 0.2106 -0.0571 0.0550 -0.2046 -0.2061 -0.1509 -0.1574 -0.1815 0.0986 0.0921 0.0991 0.0960 0.0923 0.1008 0.0932 0.0983 0.1238 0.0898 0.0946 0.0950 0.0950 0.1007 0.0886 0.1180 0.1205 0.1627 0.1788 0.1078 0.1177 0.1442 0.1423 0.1607 0.1602 0.1611
va: 2.1205 1.9953 2.2705 3.6528 3.7763 3.9066 3.9010 3.9007 3.8715 4.1237 3.6989 3.9265 3.9427 3.8413 3.6723 4.0008 3.9674 3.6466 3.8131 3.5814 3.9385 3.9551 3.8818 3.8930 3.8980 1.0232 1.0385 1.0026 1.0027 1.0024 1.0001 1.0176 1.0016 1.0068 1.0078 0.9949 0.9963 0.9978 0.9975 1.0073 0.9986 1.0079 1.0178 0.9927 1.0110 1.0081 1.0032 1.0101 0.9894 0.9898 0.9894
dispcorr: -0.022480800 hartree
energy: -1079.762668180473
dipole: 29.90327 -29.10790 0.79537 15.00137 -15.25056 -0.24920 -3.23552 3.67448 0.43896
magnitude: 0.94202 au
magnitude: 2.39442 debye
