program: Gaussian 09
title: 000063634
version: EM64L-G09RevD.01
frameworkgroup: C1[X(C17H14N2O2)]
method: RPBEPBE
basis: SDD
operation: Freq
keyword: #p
keyword: freq=noraman
keyword: PBEPBE/SDD
title: #p freq=noraman PBEPBE/SDD
converged: YES YES NO NO
title: Mulliken charges:
elementType: O O N N C C C C C C C C C C C C C C C C C H H H H H H H H H H H H H H
charge: -0.264221 -0.227187 -0.163057 -0.028432 -0.368178 -0.522451 0.186972 0.137640 0.048232 0.131756 -0.269935 0.282073 -0.327073 -0.327441 -0.241185 -0.205289 -0.334175 -0.342017 -0.244881 -0.229057 -0.221116 0.234697 0.272171 0.296253 0.245856 0.248359 0.271844 0.260976 0.234946 0.234931 0.247264 0.278016 0.233097 0.235331 0.235284
chargesum: 0.00000
title: Mulliken charges with hydrogens summed into heavy atoms:
elementType: O O N N C C C C C C C C C C C C C C C C C
charge: -0.264221 -0.227187 -0.163057 -0.028432 0.138689 0.019658 0.186972 0.137640 0.048232 0.131756 -0.021576 0.282073 -0.055229 -0.066465 -0.006239 0.029642 -0.086911 -0.064002 -0.011783 0.006274 0.014168
polarizability: 2.99291457e+02 1.78589739e+01 1.84449933e+02 -1.68187800e+01 4.62305223e+00 1.30935609e+02
1716.lowfreq: -8.0325 -2.9715 -0.0008 -0.0002 0.0003 1.6832 17.4053 23.3183 29.6458
frequency: 16.7981 23.3015 29.6352 52.0822 87.6041 99.2158 132.6549 157.4357 160.5060 207.9894 232.5169 263.7601 296.7431 323.2272 382.4396 399.9737 416.3951 425.4952 457.2149 469.6318 489.6422 507.4794 529.4224 571.9554 588.2730 596.2332 612.8998 639.5796 687.1464 692.9036 696.4024 746.6159 758.1790 785.1877 792.5619 800.4900 810.8571 854.4732 859.1599 893.8638 908.6046 943.3886 951.9591 979.2386 981.7483 990.0574 992.0700 1004.5986 1009.4961 1021.1114 1025.6690 1027.8871 1076.7631 1088.1726 1094.0654 1131.1193 1160.7156 1174.0495 1179.0074 1189.7846 1208.7365 1219.8083 1240.7980 1265.2958 1281.9605 1305.4842 1321.2614 1347.2519 1365.5838 1375.6495 1388.5282 1400.7568 1435.2893 1438.6636 1448.4291 1453.1669 1456.6412 1480.3282 1550.9873 1561.4873 1566.6864 1597.2828 1606.4581 1611.9140 1618.7236 2982.5349 3040.5724 3044.0674 3107.7625 3130.8079 3135.8402 3138.5412 3140.3133 3150.2809 3151.2190 3160.5568 3165.3282 3170.9349 3175.1285
redmass: 4.2065 6.2572 5.7692 6.2801 6.4866 2.6867 5.0827 5.1481 4.3286 5.6189 4.9985 3.4840 6.7988 4.3461 5.7951 2.8084 3.2311 3.0582 4.5777 6.2835 7.7284 4.6848 6.5169 2.2732 6.6270 3.5016 6.4388 7.2289 5.1301 4.9609 1.8251 2.7020 2.1627 1.5685 2.5607 2.1423 4.6407 4.5287 1.2876 1.4487 1.4795 1.4592 5.0492 5.2199 1.3731 5.9649 1.3966 1.3333 1.4149 2.0490 2.1372 2.0752 2.7268 1.7930 2.2732 1.6280 1.3951 1.0853 1.7137 1.1355 2.1910 2.1058 3.0591 1.4724 1.7663 1.7789 1.3850 1.9124 1.4095 2.2521 9.2286 2.5345 1.6760 1.3485 1.9767 1.3128 2.6835 2.1881 6.8092 7.3236 6.8493 6.7423 10.0130 6.3117 6.8680 1.0620 1.0629 1.0933 1.1055 1.0852 1.0862 1.0925 1.0880 1.0902 1.0924 1.0962 1.0957 1.1014 1.0997
irintensity: 0.5877 0.6579 0.5877 1.8749 4.0061 2.9196 3.2752 0.6635 0.3706 8.9258 2.1984 5.0144 5.1716 7.7570 0.9226 0.0970 1.6239 6.4272 5.9900 11.8742 2.8435 2.3304 7.8904 5.6590 7.1051 1.2864 0.2124 13.2472 10.5018 18.5418 46.4721 29.1666 46.8116 71.5810 9.3092 3.0563 2.1999 8.6930 2.0849 1.8074 11.5576 1.8531 2.8666 55.1246 3.4313 7.0045 0.6601 0.0195 0.6564 6.9683 3.2431 6.6453 0.5435 8.0277 4.2104 58.7937 5.3742 9.9147 49.6736 14.5937 2.6469 61.3762 24.9953 36.6227 10.2540 137.7040 41.8801 61.9600 40.1731 32.4405 2.8997 15.7560 21.4020 14.3805 11.1321 26.6445 48.1367 3.0384 100.1274 33.6037 118.5705 42.1922 393.4016 4.8152 15.5762 25.4180 9.1801 8.6002 3.1677 0.3159 4.4690 9.7375 5.0467 7.4154 16.7896 21.1047 11.0037 21.6486 20.7674
temp: 298.150 k
press: 1.00000 atm
elementType: 8 8 7 7 6 6 6 6 6 6 6 6 6 6 6 6 6 6 6 6 6 1 1 1 1 1 1 1 1 1 1 1 1 1 1
symmnumber: 1
zpe: 710094.4 jmol-1
zpe.correction: 0.270461 hartree
zpe.thermalcorrener: 0.287612 hartree
zpe.thermalcorrenthalpy: 0.288556 hartree
zpe.thermalcorrgfe: 0.222463 hartree
zpe.sumelectzpe: -914.727236 hartree
zpe.sumelectthermal: -914.710085 hartree
zpe.sumelectthermalent: -914.709141 hartree
zpe.sumelectthermalfe: -914.775234 hartree
dipole: -0.9139 2.2630 -2.2264
dipole: 3.3035
quadrupole: -95.1649 -120.0038 -129.1887
quadrupole: -1.3930 4.8058 -2.0692
quadrupole: 19.6209 -5.2180 -14.4029 -1.3930 4.8058 -2.0692
hfenergy: -914.9976971 hartree
pointgroup: C01 [X(C17H14N2O2)]
dipole: -0.3593851 1.1321572 -0.5275409 debye
polarizability: 299.2936729|22.0683874|175.4650219|-11.3045071|20.2020044|139.9183036 unknown
InChI: InChI=1S/C17H14N2O2/c20-16(13-6-2-1-3-7-13)10-11-19-12-18-15-9-5-4-8-14(15)17(19)21/h1-9,12H,10-11H2
charge 0 multiplicity 1
35 atoms
O  1.223119 0.078635 1.833371
O  -2.815666 -2.247273 0.12235
N  1.218259 -1.041508 -0.226566
N  3.083921 -0.987049 -1.763655
C  -0.151289 -1.546099 0.047588
C  -1.209297 -0.434414 -0.090048
C  1.84097 -0.217091 0.764684
C  3.204481 0.218812 0.410885
C  3.780526 -0.175642 -0.842976
C  -2.62929 -0.997111 0.017161
C  1.870292 -1.372388 -1.417089
C  -3.788583 -0.044976 -0.01705
C  3.945593 1.030263 1.309984
C  5.094889 0.256955 -1.172023
C  5.242984 1.447739 0.971769
C  5.816183 1.059316 -0.273167
C  -3.617601 1.361835 -0.127782
C  -5.103872 -0.580163 0.063178
C  -4.741254 2.214763 -0.159426
C  -6.224343 0.271969 0.032335
C  -6.0455 1.672689 -0.079665
H  -0.364787 -2.374641 -0.647684
H  -0.173451 -1.950812 1.072734
H  -1.040119 0.325318 0.695862
H  -1.100893 0.084111 -1.064197
H  1.301077 -2.011065 -2.101742
H  3.478092 1.312504 2.258998
H  5.513763 -0.056088 -2.133002
H  5.816679 2.072223 1.664618
H  6.828807 1.388829 -0.530454
H  -2.613908 1.795799 -0.185068
H  -5.213887 -1.66634 0.149625
H  -4.60307 3.2981 -0.243113
H  -7.23409 -0.147789 0.095527
H  -6.916634 2.336989 -0.102961
