program: Orca
programVersion: 5.0.2
elementType: O O O C C C C C C C C C C C C C C C C C C C C C C H H H H H H H H H H H H H H H H H H H H H H H H H H
charge: 0
multiplicity: 1
keywords: wb97x-d3
keywords: def2-TZVPP
keywords: def2/J RIJCOSX
keywords: DEFGRID2
keywords: scfconv7
keywords: smallprint printgap noloewdin
keywords: NOSOSCF
formula: C22H26O3
InChI: InChI=1/C22H26O3/c1-15(2)10-19-20(22(19,3)4)21(23)25-14-17-12-18(24-13-17)11-16-8-6-5-7-9-16/h5-10,12-13,19-20H,11,14H2,1-4H3
51 atoms
O  1.128137 -1.3617 -1.466612
O  0.943874 0.868201 -1.480005
O  -2.578884 -2.298523 0.878227
C  3.51595 0.546482 0.334189
C  3.859697 1.109603 -1.012015
C  3.031622 -0.156536 -0.924398
C  4.567741 -0.184829 1.131732
C  2.547353 1.306742 1.206603
C  5.218029 1.044584 -1.585538
C  1.610842 -0.129205 -1.314512
C  5.875405 2.044283 -2.182961
C  7.252688 1.83264 -2.736932
C  5.34463 3.433693 -2.364927
C  -0.254732 -1.51709 -1.831813
C  -1.143004 -1.540948 -0.639494
C  -1.445892 -0.48789 0.287734
C  -1.859256 -2.610498 -0.22285
C  -2.315434 -1.002938 1.187306
C  -3.016122 -0.4234 2.362423
C  -4.490701 -0.226943 2.104717
C  -5.39721 -1.259401 2.329399
C  -4.961923 0.984176 1.605857
C  -6.7482 -1.084529 2.060251
C  -6.312479 1.163122 1.339169
C  -7.209961 0.127609 1.564693
H  3.284876 1.990939 -1.274568
H  3.542703 -1.087483 -1.145191
H  5.193029 0.525461 1.676241
H  5.221788 -0.798964 0.514511
H  4.098212 -0.841397 1.866443
H  1.9586 0.624989 1.823676
H  1.858721 1.933695 0.644523
H  3.102327 1.961332 1.881069
H  5.719367 0.083462 -1.517299
H  7.973488 2.503343 -2.262419
H  7.600725 0.809657 -2.596982
H  7.283089 2.057081 -3.806279
H  5.274399 3.682188 -3.427089
H  4.364378 3.595959 -1.922037
H  6.029617 4.162979 -1.925777
H  -0.304781 -2.472744 -2.351217
H  -0.547493 -0.739153 -2.537457
H  -1.070843 0.522364 0.286996
H  -1.954707 -3.616784 -0.600553
H  -2.545071 0.53329 2.590297
H  -2.872286 -1.065667 3.235299
H  -5.047405 -2.205186 2.725875
H  -4.266102 1.796054 1.429363
H  -7.441659 -1.89576 2.240771
H  -6.66412 2.112926 0.957288
H  -8.263426 0.26566 1.358684
elementType: O C H
totalener: -1079.74157420 hartree
nucrepener: 2038.85708541 hartree
electener: -3118.59865961 hartree
oneelecener: -5517.10412956 hartree
twoeener: 2398.50546995 hartree
cpcmener: -0.03003058 hartree
kineticenergy: 1074.84991416 hartree
xcener: -106.460519762683 hartree
chargesum: -0.0000000
charge: -0.287170 -0.504586 -0.288505 0.112085 0.035155 -0.103167 -0.271792 -0.281164 -0.283941 0.434458 -0.049889 -0.220136 -0.253705 0.072792 -0.083285 -0.310997 -0.036900 0.201059 -0.054150 0.059450 -0.202822 -0.207991 -0.160224 -0.152313 -0.178285 0.090664 0.092287 0.097925 0.088804 0.098486 0.098490 0.091175 0.099458 0.122017 0.094269 0.089586 0.093050 0.097134 0.090730 0.095689 0.118742 0.120563 0.162830 0.178793 0.110476 0.117296 0.142163 0.144402 0.160076 0.159792 0.161123
qa: -0.2872 -0.5046 -0.2885 0.1121 0.0352 -0.1032 -0.2718 -0.2812 -0.2839 0.4345 -0.0499 -0.2201 -0.2537 0.0728 -0.0833 -0.3110 -0.0369 0.2011 -0.0541 0.0594 -0.2028 -0.2080 -0.1602 -0.1523 -0.1783 0.0907 0.0923 0.0979 0.0888 0.0985 0.0985 0.0912 0.0995 0.1220 0.0943 0.0896 0.0930 0.0971 0.0907 0.0957 0.1187 0.1206 0.1628 0.1788 0.1105 0.1173 0.1422 0.1444 0.1601 0.1598 0.1611
va: 2.1202 1.9920 2.2702 3.6859 3.7733 3.8506 3.9048 3.9037 3.8702 4.1300 3.7599 3.9199 3.9414 3.8431 3.6781 4.0069 3.9682 3.6703 3.8132 3.5704 3.9523 3.9400 3.8936 3.8841 3.8957 1.0339 1.0352 1.0015 1.0062 1.0014 1.0001 1.0163 1.0016 1.0100 0.9963 1.0085 0.9961 0.9964 1.0099 0.9973 0.9989 1.0075 1.0169 0.9925 1.0098 1.0054 1.0089 1.0031 0.9899 0.9899 0.9893
dispcorr: -0.022059613 hartree
energy: -1079.763633810456
dipole: 29.88321 -29.16986 0.71335 13.10420 -13.53273 -0.42853 -1.82991 2.12658 0.29667
magnitude: 0.88347 au
magnitude: 2.24561 debye
