program: Orca
programVersion: 5.0.2
elementType: O O O C C C C C C C C C C C C C C C C C C C C C C H H H H H H H H H H H H H H H H H H H H H H H H H H
charge: 0
multiplicity: 1
keywords: wb97x-d3
keywords: def2-TZVPP
keywords: def2/J RIJCOSX
keywords: DEFGRID2
keywords: scfconv7
keywords: smallprint printgap noloewdin
keywords: NOSOSCF
formula: C22H26O3
InChI: InChI=1/C22H26O3/c1-15(2)10-19-20(22(19,3)4)21(23)25-14-17-12-18(24-13-17)11-16-8-6-5-7-9-16/h5-10,12-13,19-20H,11,14H2,1-4H3
51 atoms
O  1.841973 -2.246729 0.317446
O  1.456401 -1.549392 -1.77383
O  -2.456409 -2.534576 -0.359743
C  1.227174 1.124995 -0.060772
C  2.369596 1.18763 -1.036287
C  2.243037 -0.007113 -0.122346
C  1.246377 1.967592 1.190801
C  -0.166524 0.923312 -0.607497
C  3.521964 2.094885 -0.86385
C  1.821724 -1.319227 -0.643397
C  4.121479 2.814369 -1.818692
C  5.317506 3.661952 -1.501221
C  3.705383 2.84799 -3.257801
C  1.061563 -3.437743 0.100511
C  -0.379279 -3.085947 0.194156
C  -1.057854 -2.593111 1.356533
C  -1.277871 -3.01772 -0.814267
C  -2.311078 -2.268882 0.964835
C  -3.446832 -1.609589 1.661466
C  -3.418222 -0.116164 1.432423
C  -2.757738 0.718517 2.329809
C  -3.992563 0.442985 0.294292
C  -2.675214 2.084943 2.098641
C  -3.910885 1.809436 0.059976
C  -3.251797 2.63497 0.961439
H  2.075107 0.994488 -2.06222
H  2.917119 -0.051344 0.726737
H  0.595113 1.530576 1.950518
H  0.876378 2.973182 0.980825
H  2.240329 2.061279 1.625978
H  -0.18638 0.384544 -1.552631
H  -0.634658 1.894356 -0.779579
H  -0.791184 0.38006 0.10554
H  3.929424 2.159214 0.141181
H  5.600081 3.600828 -0.450428
H  6.180218 3.358136 -2.100104
H  5.131485 4.711846 -1.74158
H  2.772117 2.326482 -3.460687
H  3.586894 3.880419 -3.595686
H  4.478452 2.405965 -3.892374
H  1.364358 -4.113616 0.898106
H  1.307242 -3.906876 -0.852586
H  -0.653656 -2.48293 2.350837
H  -1.228048 -3.276443 -1.86034
H  -3.366178 -1.824164 2.727546
H  -4.395175 -2.030015 1.319569
H  -2.303653 0.295758 3.218427
H  -4.511284 -0.192416 -0.413904
H  -2.161769 2.720271 2.808891
H  -4.364293 2.229863 -0.82846
H  -3.189378 3.699985 0.779668
elementType: O C H
totalener: -1079.74002808 hartree
nucrepener: 2200.45446483 hartree
electener: -3280.19449291 hartree
oneelecener: -5840.60119746 hartree
twoeener: 2560.40670455 hartree
cpcmener: -0.03073785 hartree
kineticenergy: 1074.85353266 hartree
xcener: -106.463329549270 hartree
chargesum: -0.0000000
charge: -0.291625 -0.483697 -0.280816 0.177531 0.020100 -0.083043 -0.296783 -0.276696 -0.288320 0.374961 -0.050055 -0.219401 -0.256409 0.098511 -0.055065 -0.341878 -0.036268 0.201746 -0.054985 0.047875 -0.182692 -0.189377 -0.172732 -0.158845 -0.172741 0.089624 0.094202 0.095098 0.100258 0.096450 0.101612 0.110051 0.040849 0.120543 0.088758 0.093315 0.093776 0.090915 0.094481 0.099427 0.123175 0.117728 0.160796 0.175815 0.110009 0.114259 0.140386 0.140204 0.160284 0.158835 0.159853
qa: -0.2916 -0.4837 -0.2808 0.1775 0.0201 -0.0830 -0.2968 -0.2767 -0.2883 0.3750 -0.0501 -0.2194 -0.2564 0.0985 -0.0551 -0.3419 -0.0363 0.2017 -0.0550 0.0479 -0.1827 -0.1894 -0.1727 -0.1588 -0.1727 0.0896 0.0942 0.0951 0.1003 0.0964 0.1016 0.1101 0.0408 0.1205 0.0888 0.0933 0.0938 0.0909 0.0945 0.0994 0.1232 0.1177 0.1608 0.1758 0.1100 0.1143 0.1404 0.1402 0.1603 0.1588 0.1599
va: 2.0976 2.0139 2.2570 3.5851 3.8083 3.8007 3.9073 3.9016 3.8816 4.2368 3.7603 3.9197 3.9408 3.8265 3.6276 3.9636 3.9407 3.6079 3.8125 3.5747 3.8654 3.9240 3.8460 3.8843 3.8489 1.0328 1.0349 1.0022 1.0006 1.0092 1.0256 0.9987 1.0107 1.0118 1.0088 0.9954 0.9966 1.0097 0.9977 0.9956 0.9927 1.0096 1.0093 0.9985 1.0112 1.0116 1.0042 1.0093 0.9897 0.9903 0.9904
dispcorr: -0.027711022 hartree
energy: -1079.767739104430
dipole: 13.99645 -14.02550 -0.02905 21.80727 -21.43385 0.37342 -3.01707 4.25739 1.24032
magnitude: 1.29564 au
magnitude: 3.29325 debye
