program: Orca
programVersion: 5.0.2
elementType: O O O C C C C C C C C C C C C C C C C C C C C C C H H H H H H H H H H H H H H H H H H H H H H H H H H
charge: 0
multiplicity: 1
keywords: wb97x-d3
keywords: def2-TZVPP
keywords: def2/J RIJCOSX
keywords: DEFGRID2
keywords: scfconv7
keywords: smallprint printgap noloewdin
keywords: NOSOSCF
formula: C22H26O3
InChI: InChI=1/C22H26O3/c1-15(2)10-19-20(22(19,3)4)21(23)25-14-17-12-18(24-13-17)11-16-8-6-5-7-9-16/h5-10,12-13,19-20H,11,14H2,1-4H3
51 atoms
O  1.50743 -1.633413 -0.925525
O  2.159839 -1.902296 1.195456
O  -2.173515 -2.633967 1.241509
C  1.703345 1.370748 0.040513
C  2.61988 1.025966 -1.09972
C  2.613338 0.15805 0.139352
C  2.035169 2.527787 0.950391
C  0.217282 1.185117 -0.154398
C  3.83521 1.808512 -1.40373
C  2.078269 -1.216517 0.199004
C  4.231315 2.232887 -2.608357
C  5.513104 2.994549 -2.768097
C  3.483406 2.003152 -3.886332
C  0.787832 -2.881362 -0.897684
C  -0.542006 -2.695013 -0.26227
C  -1.676614 -2.028259 -0.830117
C  -0.906186 -3.036204 0.995081
C  -2.635021 -2.013871 0.123704
C  -3.97722 -1.382998 0.19793
C  -3.913716 -0.10029 0.993538
C  -4.269125 -0.071366 2.337625
C  -3.436928 1.065144 0.398048
C  -4.152322 1.101289 3.074182
C  -3.321423 2.237758 1.12998
C  -3.678213 2.258604 2.47286
H  2.11086 0.603098 -1.95811
H  3.449107 0.290561 0.818562
H  3.09943 2.606602 1.167539
H  1.513261 2.422628 1.903306
H  1.714673 3.47001 0.501335
H  -0.236266 2.13436 -0.446349
H  -0.263613 0.86475 0.772314
H  -0.026766 0.461007 -0.929015
H  4.471518 2.044012 -0.555225
H  6.18979 2.481311 -3.456434
H  5.331998 3.983602 -3.19665
H  6.034957 3.127972 -1.820706
H  2.508379 1.540102 -3.749701
H  3.328518 2.948712 -4.411427
H  4.062032 1.368738 -4.562769
H  1.371941 -3.653646 -0.397508
H  0.687352 -3.159981 -1.944905
H  -1.756536 -1.606311 -1.81988
H  -0.396915 -3.55622 1.791216
H  -4.7004 -2.070194 0.642945
H  -4.311513 -1.178676 -0.819968
H  -4.642245 -0.970624 2.813228
H  -3.148783 1.052507 -0.647092
H  -4.43258 1.109473 4.11961
H  -2.951548 3.135788 0.651927
H  -3.588153 3.172241 3.045851
elementType: O C H
totalener: -1079.73949826 hartree
nucrepener: 2157.78482931 hartree
electener: -3237.52432757 hartree
oneelecener: -5754.80782738 hartree
twoeener: 2517.28349981 hartree
cpcmener: -0.03252083 hartree
kineticenergy: 1074.86040233 hartree
xcener: -106.463528803695 hartree
chargesum: -0.0000000
charge: -0.279949 -0.498302 -0.285227 0.141899 0.067849 -0.121508 -0.279825 -0.321600 -0.305181 0.424074 -0.045818 -0.221915 -0.255189 0.069358 -0.045371 -0.403415 -0.020645 0.234171 -0.044615 0.088575 -0.209930 -0.256234 -0.151963 -0.151010 -0.175392 0.096522 0.093087 0.090696 0.097930 0.097028 0.102842 0.106166 0.098674 0.120762 0.093352 0.094208 0.088726 0.090275 0.094704 0.098667 0.121018 0.121357 0.164981 0.176004 0.111476 0.114687 0.143083 0.148197 0.159879 0.161510 0.161331
qa: -0.2799 -0.4983 -0.2852 0.1419 0.0678 -0.1215 -0.2798 -0.3216 -0.3052 0.4241 -0.0458 -0.2219 -0.2552 0.0694 -0.0454 -0.4034 -0.0206 0.2342 -0.0446 0.0886 -0.2099 -0.2562 -0.1520 -0.1510 -0.1754 0.0965 0.0931 0.0907 0.0979 0.0970 0.1028 0.1062 0.0987 0.1208 0.0934 0.0942 0.0887 0.0903 0.0947 0.0987 0.1210 0.1214 0.1650 0.1760 0.1115 0.1147 0.1431 0.1482 0.1599 0.1615 0.1613
va: 2.1151 1.9937 2.2649 3.6807 3.7274 3.8432 3.9032 3.9137 3.8640 4.1679 3.7576 3.9222 3.9413 3.8327 3.6002 3.9834 3.9645 3.5812 3.8121 3.5319 3.9658 3.9182 3.8859 3.8555 3.9008 1.0262 1.0335 1.0059 1.0015 1.0019 0.9999 0.9900 1.0074 1.0105 0.9954 0.9964 1.0088 1.0098 0.9977 0.9958 1.0092 0.9950 1.0070 0.9999 1.0108 1.0087 1.0052 1.0003 0.9896 0.9899 0.9887
dispcorr: -0.025680456 hartree
energy: -1079.765178712147
dipole: 14.58010 -15.11170 -0.53160 20.93777 -20.11714 0.82063 -11.78609 10.25521 -1.53089
magnitude: 1.81649 au
magnitude: 4.61716 debye
