program: Orca
programVersion: 5.0.2
elementType: O O O C C C C C C C C C C C C C C C C C C C C C C H H H H H H H H H H H H H H H H H H H H H H H H H H
charge: 0
multiplicity: 1
keywords: wb97x-d3
keywords: def2-TZVPP
keywords: def2/J RIJCOSX
keywords: DEFGRID2
keywords: scfconv7
keywords: smallprint printgap noloewdin
keywords: NOSOSCF
formula: C22H26O3
InChI: InChI=1/C22H26O3/c1-15(2)10-19-20(22(19,3)4)21(23)25-14-17-12-18(24-13-17)11-16-8-6-5-7-9-16/h5-10,12-13,19-20H,11,14H2,1-4H3
51 atoms
O  1.554687 -1.788909 -0.958826
O  2.313929 -1.931391 1.138069
O  -2.020218 -2.64335 1.432973
C  1.783388 1.26814 -0.08276
C  2.595189 0.905301 -1.29563
C  2.709311 0.062799 -0.053086
C  2.19956 2.452574 0.752231
C  0.28753 1.06987 -0.131591
C  3.773563 1.704815 -1.711672
C  2.183642 -1.307752 0.106602
C  3.814984 2.553159 -2.742716
C  5.069699 3.30084 -3.078744
C  2.647673 2.84062 -3.635757
C  0.842564 -3.033754 -0.81587
C  -0.457243 -2.80619 -0.13425
C  -1.618919 -2.183203 -0.695624
C  -0.762895 -3.059475 1.159034
C  -2.534884 -2.104789 0.295979
C  -3.879784 -1.481947 0.382282
C  -3.808796 -0.158606 1.107228
C  -3.344322 0.97473 0.443959
C  -4.151788 -0.057203 2.450912
C  -3.228584 2.186285 1.10911
C  -4.035851 1.154892 3.120518
C  -3.573967 2.279678 2.451858
H  2.011841 0.478131 -2.104706
H  3.604807 0.214588 0.540852
H  1.84429 3.381178 0.300213
H  3.281111 2.529213 0.860815
H  1.768718 2.386899 1.753219
H  -0.104281 0.772398 0.843324
H  -0.020613 0.32263 -0.860596
H  -0.19906 2.007657 -0.406358
H  4.672443 1.587737 -1.112913
H  5.885838 3.061418 -2.397477
H  5.401218 3.073655 -4.095121
H  4.904416 4.380517 -3.043037
H  2.890239 2.615218 -4.677136
H  1.751593 2.282154 -3.37069
H  2.397378 3.904087 -3.603107
H  1.451856 -3.769807 -0.29222
H  0.695194 -3.382168 -1.836165
H  -1.746304 -1.831953 -1.707616
H  -0.2173 -3.520697 1.96722
H  -4.580911 -2.151441 0.885501
H  -4.248194 -1.334836 -0.633663
H  -3.067321 0.906404 -0.6019
H  -4.515675 -0.930374 2.979114
H  -2.869071 3.058458 0.578447
H  -4.307888 1.219988 4.16604
H  -3.484874 3.224492 2.971829
elementType: O C H
totalener: -1079.73863379 hartree
nucrepener: 2161.95812983 hartree
electener: -3241.69676362 hartree
oneelecener: -5763.16591587 hartree
twoeener: 2521.46915225 hartree
cpcmener: -0.03219095 hartree
kineticenergy: 1074.87027059 hartree
xcener: -106.464124744075 hartree
chargesum: 0.0000000
charge: -0.278294 -0.498108 -0.285147 0.191605 0.027587 -0.156492 -0.272495 -0.346187 -0.291982 0.426865 -0.032660 -0.230488 -0.252613 0.071819 -0.047623 -0.400321 -0.020743 0.232803 -0.044979 0.083247 -0.248285 -0.207905 -0.155265 -0.153587 -0.173696 0.101781 0.096190 0.095546 0.092434 0.098462 0.108776 0.098583 0.101986 0.122345 0.089485 0.095008 0.094234 0.097761 0.088102 0.097215 0.120815 0.121907 0.164482 0.176494 0.111313 0.115690 0.147613 0.143429 0.162299 0.159992 0.161001
qa: -0.2783 -0.4981 -0.2851 0.1916 0.0276 -0.1565 -0.2725 -0.3462 -0.2920 0.4269 -0.0327 -0.2305 -0.2526 0.0718 -0.0476 -0.4003 -0.0207 0.2328 -0.0450 0.0832 -0.2483 -0.2079 -0.1553 -0.1536 -0.1737 0.1018 0.0962 0.0955 0.0924 0.0985 0.1088 0.0986 0.1020 0.1223 0.0895 0.0950 0.0942 0.0978 0.0881 0.0972 0.1208 0.1219 0.1645 0.1765 0.1113 0.1157 0.1476 0.1434 0.1623 0.1600 0.1610
va: 2.1199 1.9935 2.2643 3.6622 3.7502 3.9072 3.8960 3.9091 3.8600 4.1696 3.7069 3.9264 3.9425 3.8306 3.6021 3.9799 3.9625 3.5815 3.8110 3.5396 3.9160 3.9638 3.8585 3.8869 3.9007 1.0178 1.0343 1.0027 1.0028 1.0026 0.9902 1.0061 1.0009 1.0074 1.0078 0.9954 0.9961 0.9979 1.0087 0.9971 1.0099 0.9948 1.0074 0.9998 1.0104 1.0083 1.0005 1.0047 0.9899 0.9895 0.9889
dispcorr: -0.026147796 hartree
energy: -1079.764781584854
dipole: 12.34143 -13.02169 -0.68026 22.75700 -21.89673 0.86027 -12.13332 10.63138 -1.50193
magnitude: 1.85974 au
magnitude: 4.72707 debye
