program: Orca
programVersion: 5.0.2
elementType: O O O C C C C C C C C C C C C C C C C C C C C C C H H H H H H H H H H H H H H H H H H H H H H H H H H
charge: 0
multiplicity: 1
keywords: wb97x-d3
keywords: def2-TZVPP
keywords: def2/J RIJCOSX
keywords: DEFGRID2
keywords: scfconv7
keywords: smallprint printgap noloewdin
keywords: NOSOSCF
formula: C22H26O3
InChI: InChI=1/C22H26O3/c1-15(2)10-19-20(22(19,3)4)21(23)25-14-17-12-18(24-13-17)11-16-8-6-5-7-9-16/h5-10,12-13,19-20H,11,14H2,1-4H3
51 atoms
O  2.079429 -1.989183 0.467404
O  2.243636 -2.082801 -1.75757
O  -2.069633 -2.051465 -0.775569
C  3.901503 0.486361 0.364141
C  2.471477 0.891582 0.348183
C  2.975817 -0.124002 -0.67563
C  4.93193 1.434658 -0.203162
C  4.428585 -0.329302 1.519125
C  1.971989 2.206231 -0.120003
C  2.421127 -1.485062 -0.716093
C  0.74886 2.357326 -0.636995
C  0.236264 3.689991 -1.082446
C  -0.173851 1.1822 -0.814226
C  1.199206 -3.128872 0.479502
C  -0.198951 -2.6809 0.240057
C  -1.112277 -2.165443 1.216654
C  -0.838673 -2.58176 -0.949474
C  -2.231587 -1.801778 0.549324
C  -3.505977 -1.168523 0.976619
C  -3.541375 0.30096 0.63077
C  -3.022295 1.240902 1.517195
C  -4.047057 0.736289 -0.590427
C  -3.00791 2.589529 1.191367
C  -4.03461 2.085825 -0.919701
C  -3.514692 3.016272 -0.029875
H  1.868596 0.438913 1.131876
H  3.121439 0.264643 -1.677204
H  5.82336 0.888316 -0.516034
H  5.238671 2.161737 0.550969
H  4.562881 1.985938 -1.067888
H  5.206701 -1.019885 1.189024
H  3.658715 -0.903893 2.027587
H  4.876084 0.337229 2.258707
H  2.621993 3.070088 -0.017001
H  -0.042421 3.66768 -2.13925
H  -0.668779 3.964276 -0.534008
H  0.97136 4.482208 -0.941975
H  0.218785 0.476774 -1.551548
H  -0.304952 0.623547 0.114714
H  -1.161142 1.492279 -1.155544
H  1.307078 -3.553523 1.475328
H  1.520814 -3.877444 -0.243496
H  -0.947419 -2.083253 2.279725
H  -0.562984 -2.848421 -1.957478
H  -3.600202 -1.300399 2.055018
H  -4.352511 -1.683798 0.516024
H  -2.623223 0.91239 2.469797
H  -4.458528 0.016543 -1.288242
H  -2.601385 3.308213 1.891302
H  -4.432513 2.410542 -1.872507
H  -3.504969 4.067905 -0.285285
elementType: O C H
totalener: -1079.73625828 hartree
nucrepener: 2242.62267435 hartree
electener: -3322.35893263 hartree
oneelecener: -5924.58596167 hartree
twoeener: 2602.22702904 hartree
cpcmener: -0.02903263 hartree
kineticenergy: 1074.86732347 hartree
xcener: -106.466588859482 hartree
chargesum: 0.0000000
charge: -0.285879 -0.505864 -0.282898 0.163994 0.013840 -0.094222 -0.291731 -0.276920 -0.357606 0.382443 0.067062 -0.235163 -0.318386 0.075765 -0.059380 -0.333121 -0.023602 0.196186 -0.045211 0.059387 -0.219290 -0.201436 -0.134058 -0.128339 -0.213917 0.105056 0.091551 0.098790 0.100161 0.092907 0.100685 0.092097 0.093436 0.125351 0.103852 0.093035 0.093092 0.116191 0.089954 0.099144 0.113987 0.121849 0.159881 0.169122 0.112030 0.114513 0.140803 0.140634 0.160079 0.157578 0.162568
qa: -0.2859 -0.5059 -0.2829 0.1640 0.0138 -0.0942 -0.2917 -0.2769 -0.3576 0.3824 0.0671 -0.2352 -0.3184 0.0758 -0.0594 -0.3331 -0.0236 0.1962 -0.0452 0.0594 -0.2193 -0.2014 -0.1341 -0.1283 -0.2139 0.1051 0.0916 0.0988 0.1002 0.0929 0.1007 0.0921 0.0934 0.1254 0.1039 0.0930 0.0931 0.1162 0.0900 0.0991 0.1140 0.1218 0.1599 0.1691 0.1120 0.1145 0.1408 0.1406 0.1601 0.1576 0.1626
va: 2.1004 1.9837 2.2583 3.7345 3.7567 3.8108 3.9125 3.8827 3.8861 4.1534 3.6133 3.9116 3.9783 3.8218 3.6077 3.9713 3.9205 3.6065 3.7989 3.5444 3.8909 3.9411 3.8043 3.8459 3.8611 1.0223 1.0305 1.0023 0.9994 1.0016 0.9997 1.0149 1.0008 1.0048 0.9939 0.9954 1.0087 1.0059 0.9938 1.0132 0.9981 1.0122 1.0076 1.0065 1.0102 1.0089 1.0049 1.0084 0.9890 0.9906 0.9892
dispcorr: -0.029902098 hartree
energy: -1079.766160373795
dipole: 11.00508 -11.34814 -0.34306 16.09728 -15.48980 0.60748 2.71300 -1.21859 1.49441
magnitude: 1.64924 au
magnitude: 4.19204 debye
