program: Orca
programVersion: 5.0.2
elementType: O O O C C C C C C C C C C C C C C C C C C C C C C H H H H H H H H H H H H H H H H H H H H H H H H H H
charge: 0
multiplicity: 1
keywords: wb97x-d3
keywords: def2-TZVPP
keywords: def2/J RIJCOSX
keywords: DEFGRID2
keywords: scfconv7
keywords: smallprint printgap noloewdin
keywords: NOSOSCF
formula: C22H26O3
InChI: InChI=1/C22H26O3/c1-15(2)10-19-20(22(19,3)4)21(23)25-14-17-12-18(24-13-17)11-16-8-6-5-7-9-16/h5-10,12-13,19-20H,11,14H2,1-4H3
51 atoms
O  1.465797 -1.652393 -0.108803
O  2.093465 0.082457 1.155885
O  -2.362828 0.1875 1.204045
C  4.639596 -0.194914 -0.714327
C  3.846432 1.030932 -1.055451
C  3.141603 -0.301473 -0.96262
C  5.525837 -0.806479 -1.771395
C  5.20265 -0.327663 0.678859
C  3.966795 1.700992 -2.371137
C  2.199686 -0.569142 0.140372
C  4.51456 2.901814 -2.582332
C  4.588057 3.488072 -3.959656
C  5.107703 3.756889 -1.504786
C  0.5077 -2.064999 0.882604
C  -0.75816 -1.290573 0.792777
C  -1.839178 -1.504353 -0.124445
C  -1.136979 -0.249372 1.569791
C  -2.78645 -0.584729 0.169458
C  -4.14263 -0.311287 -0.371869
C  -5.204619 -0.458753 0.690688
C  -5.638457 -1.723296 1.081556
C  -5.734427 0.658577 1.326939
C  -6.584455 -1.867391 2.086051
C  -6.680863 0.517705 2.33445
C  -7.107459 -0.745728 2.718057
H  3.669898 1.688293 -0.20989
H  2.876685 -0.774416 -1.90237
H  5.078116 -0.780959 -2.764165
H  5.743343 -1.84908 -1.532803
H  6.477897 -0.274209 -1.822826
H  4.628714 0.212823 1.428401
H  6.218239 0.07219 0.698753
H  5.258131 -1.374641 0.983537
H  3.585832 1.155191 -3.229788
H  5.624384 3.685827 -4.245442
H  4.150432 2.831538 -4.711346
H  4.06827 4.448529 -4.005424
H  5.023573 3.32674 -0.508699
H  6.169071 3.930385 -1.700252
H  4.635249 4.742148 -1.486456
H  0.941426 -2.001917 1.880697
H  0.326957 -3.115747 0.662838
H  -1.902606 -2.259976 -0.891946
H  -0.666934 0.262721 2.394523
H  -4.320368 -1.011409 -1.189287
H  -4.184216 0.6940 -0.800016
H  -5.232407 -2.602721 0.595142
H  -5.407541 1.64825 1.030882
H  -6.914177 -2.85678 2.375858
H  -7.083719 1.397315 2.819778
H  -7.844931 -0.856895 3.502301
elementType: O C H
totalener: -1079.74101275 hartree
nucrepener: 2021.02034832 hartree
electener: -3100.76136107 hartree
oneelecener: -5481.65985396 hartree
twoeener: 2380.89849289 hartree
cpcmener: -0.03080059 hartree
kineticenergy: 1074.85313537 hartree
xcener: -106.459945213777 hartree
chargesum: 0.0000000
charge: -0.288668 -0.505386 -0.286741 0.141689 0.014832 -0.141070 -0.262879 -0.290227 -0.281172 0.434084 -0.033949 -0.227205 -0.252690 0.089271 -0.085039 -0.332813 -0.014414 0.185480 -0.039997 0.042963 -0.200997 -0.190102 -0.159602 -0.161287 -0.173209 0.092124 0.092213 0.090011 0.098086 0.096139 0.091043 0.096624 0.101486 0.124067 0.093995 0.089672 0.095288 0.089281 0.096942 0.096513 0.121262 0.123413 0.164097 0.173562 0.115306 0.110276 0.144670 0.142524 0.159822 0.159311 0.161401
qa: -0.2887 -0.5054 -0.2867 0.1417 0.0148 -0.1411 -0.2629 -0.2902 -0.2812 0.4341 -0.0339 -0.2272 -0.2527 0.0893 -0.0850 -0.3328 -0.0144 0.1855 -0.0400 0.0430 -0.2010 -0.1901 -0.1596 -0.1613 -0.1732 0.0921 0.0922 0.0900 0.0981 0.0961 0.0910 0.0966 0.1015 0.1241 0.0940 0.0897 0.0953 0.0893 0.0969 0.0965 0.1213 0.1234 0.1641 0.1736 0.1153 0.1103 0.1447 0.1425 0.1598 0.1593 0.1614
va: 2.1212 1.9946 2.2689 3.6706 3.7612 3.9015 3.9067 3.9049 3.8700 4.1460 3.7169 3.9240 3.9445 3.8080 3.6105 4.0097 3.9437 3.6409 3.8084 3.5778 3.9350 3.9424 3.8954 3.8929 3.8906 1.0308 1.0378 1.0034 1.0027 1.0031 1.0180 1.0008 0.9990 1.0071 0.9961 1.0080 0.9955 1.0086 0.9971 0.9979 1.0113 0.9938 1.0059 1.0022 1.0069 1.0043 1.0026 1.0046 0.9901 0.9903 0.9892
dispcorr: -0.021763297 hartree
energy: -1079.762776050947
dipole: 29.18550 -28.87151 0.31399 9.60750 -10.27906 -0.67156 -12.67462 11.64497 -1.02965
magnitude: 1.26876 au
magnitude: 3.22494 debye
