program: Orca
programVersion: 5.0.2
elementType: O O O C C C C C C C C C C C C C C C C C C C C C C H H H H H H H H H H H H H H H H H H H H H H H H H H
charge: 0
multiplicity: 1
keywords: wb97x-d3
keywords: def2-TZVPP
keywords: def2/J RIJCOSX
keywords: DEFGRID2
keywords: scfconv7
keywords: smallprint printgap noloewdin
keywords: NOSOSCF
formula: C22H26O3
InChI: InChI=1/C22H26O3/c1-15(2)10-19-20(22(19,3)4)21(23)25-14-17-12-18(24-13-17)11-16-8-6-5-7-9-16/h5-10,12-13,19-20H,11,14H2,1-4H3
51 atoms
O  1.558704 -1.7562 0.489177
O  1.428277 -1.207966 -1.675527
O  -2.720603 -2.233032 -0.471878
C  2.045054 1.648868 -0.483694
C  3.258532 1.090775 -1.163941
C  2.531762 0.251574 -0.13263
C  2.211823 2.689465 0.597174
C  0.792935 1.847431 -1.301407
C  4.623682 1.570333 -0.868796
C  1.791828 -0.952901 -0.548543
C  5.536422 1.967756 -1.761679
C  6.889963 2.434071 -1.316316
C  5.327347 2.001632 -3.244806
C  0.797217 -2.954784 0.25463
C  -0.662592 -2.672979 0.234273
C  -1.523439 -2.514181 1.368931
C  -1.448497 -2.487698 -0.851993
C  -2.759516 -2.251821 0.886098
C  -4.05868 -1.948231 1.540179
C  -4.380213 -0.47375 1.482234
C  -3.962955 0.374943 2.503905
C  -5.059622 0.068111 0.394849
C  -4.220965 1.737394 2.443922
C  -5.316451 1.431502 0.330467
C  -4.896355 2.27079 1.353723
H  3.079733 0.781666 -2.188216
H  3.003685 0.173215 0.84069
H  3.069837 2.49818 1.239902
H  1.325252 2.722041 1.233105
H  2.338804 3.680488 0.156506
H  0.723158 1.177972 -2.155839
H  0.772407 2.867976 -1.688671
H  -0.101772 1.712064 -0.6905
H  4.90117 1.601957 0.181022
H  7.001036 2.405018 -0.232571
H  7.680835 1.818947 -1.75355
H  7.078586 3.458323 -1.64843
H  5.450505 3.0205 -3.620736
H  6.080402 1.394727 -3.75372
H  4.347346 1.651307 -3.561965
H  1.050204 -3.606262 1.089003
H  1.124746 -3.443015 -0.663112
H  -1.249649 -2.593524 2.409477
H  -1.255983 -2.520658 -1.912746
H  -3.994045 -2.274373 2.578677
H  -4.858754 -2.527197 1.072193
H  -3.433643 -0.035315 3.356101
H  -5.395257 -0.579284 -0.406694
H  -3.894566 2.382435 3.249594
H  -5.846131 1.838548 -0.521264
H  -5.101397 3.332366 1.306378
elementType: O C H
totalener: -1079.74143148 hartree
nucrepener: 2081.52991091 hartree
electener: -3161.27134238 hartree
oneelecener: -5602.73801070 hartree
twoeener: 2441.46666832 hartree
cpcmener: -0.03045216 hartree
kineticenergy: 1074.85222002 hartree
xcener: -106.460183811443 hartree
chargesum: 0.0000000
charge: -0.289702 -0.503309 -0.285964 0.112612 0.041116 -0.113504 -0.269073 -0.279567 -0.286903 0.422991 -0.047437 -0.220354 -0.251995 0.093051 -0.081971 -0.336777 -0.019373 0.204856 -0.056793 0.060611 -0.208041 -0.207489 -0.153547 -0.156436 -0.180300 0.090680 0.091288 0.089149 0.098455 0.097374 0.090705 0.097532 0.099268 0.122384 0.088824 0.094045 0.093696 0.097048 0.095865 0.089719 0.121795 0.121088 0.164800 0.172962 0.111422 0.115457 0.144143 0.143154 0.160884 0.160159 0.161403
qa: -0.2897 -0.5033 -0.2860 0.1126 0.0411 -0.1135 -0.2691 -0.2796 -0.2869 0.4230 -0.0474 -0.2204 -0.2520 0.0931 -0.0820 -0.3368 -0.0194 0.2049 -0.0568 0.0606 -0.2080 -0.2075 -0.1535 -0.1564 -0.1803 0.0907 0.0913 0.0891 0.0985 0.0974 0.0907 0.0975 0.0993 0.1224 0.0888 0.0940 0.0937 0.0970 0.0959 0.0897 0.1218 0.1211 0.1648 0.1730 0.1114 0.1155 0.1441 0.1432 0.1609 0.1602 0.1614
va: 2.1228 1.9961 2.2693 3.6841 3.7640 3.8648 3.9073 3.9052 3.8670 4.1475 3.7529 3.9202 3.9419 3.8047 3.6176 4.0148 3.9443 3.6204 3.8168 3.5676 3.9418 3.9562 3.8864 3.8897 3.8970 1.0336 1.0367 1.0056 1.0019 1.0020 1.0186 1.0006 0.9994 1.0092 1.0087 0.9961 0.9962 0.9970 0.9969 1.0097 0.9944 1.0106 1.0058 1.0031 1.0091 1.0082 1.0033 1.0083 0.9896 0.9898 0.9894
dispcorr: -0.022161746 hartree
energy: -1079.763593224847
dipole: 22.52926 -22.26193 0.26733 19.59914 -19.33847 0.26068 -4.86389 5.97434 1.11045
magnitude: 1.17154 au
magnitude: 2.97782 debye
