program: Orca
programVersion: 5.0.2
elementType: O O O C C C C C C C C C C C C C C C C C C C C C C H H H H H H H H H H H H H H H H H H H H H H H H H H
charge: 0
multiplicity: 1
keywords: wb97x-d3
keywords: def2-TZVPP
keywords: def2/J RIJCOSX
keywords: DEFGRID2
keywords: scfconv7
keywords: smallprint printgap noloewdin
keywords: NOSOSCF
formula: C22H26O3
InChI: InChI=1/C22H26O3/c1-15(2)10-19-20(22(19,3)4)21(23)25-14-17-12-18(24-13-17)11-16-8-6-5-7-9-16/h5-10,12-13,19-20H,11,14H2,1-4H3
51 atoms
O  1.471241 -1.809327 -1.072115
O  2.401995 -2.167841 0.928256
O  -1.838304 -2.926512 1.515168
C  1.631552 1.136459 0.065436
C  2.423058 0.918838 -1.190291
C  2.612854 -0.025259 -0.034142
C  2.029456 2.250554 1.000726
C  0.141631 0.893821 0.032086
C  3.546038 1.8098 -1.58391
C  2.160667 -1.429161 -0.002909
C  3.407312 2.926465 -2.302687
C  4.590294 3.762014 -2.68483
C  2.082497 3.433779 -2.782211
C  0.795195 -3.082035 -1.022166
C  -0.442055 -2.958324 -0.209564
C  -1.656798 -2.310992 -0.604013
C  -0.61391 -3.308638 1.086394
C  -2.466426 -2.309825 0.479209
C  -3.78355 -1.671498 0.746107
C  -3.593566 -0.213668 1.095631
C  -3.22067 0.169677 2.381578
C  -3.720062 0.765119 0.114053
C  -2.9756 1.503956 2.677826
C  -3.480161 2.100759 0.40877
C  -3.102745 2.474169 1.691612
H  1.834456 0.529479 -2.016026
H  3.515417 0.117487 0.551586
H  1.665804 2.051821 2.01079
H  1.592677 3.196859 0.673784
H  3.109311 2.384956 1.055953
H  -0.375185 1.836549 -0.159057
H  -0.220558 0.510592 0.988942
H  -0.161781 0.198033 -0.747465
H  4.542568 1.519851 -1.262747
H  4.489355 4.78125 -2.303296
H  5.524562 3.349503 -2.304442
H  4.676116 3.846712 -3.771179
H  1.243682 2.820178 -2.456949
H  1.909919 4.451925 -2.423972
H  2.058045 3.485253 -3.873979
H  1.458829 -3.859748 -0.644649
H  0.564682 -3.309303 -2.060994
H  -1.88361 -1.881446 -1.567649
H  0.010531 -3.822886 1.799914
H  -4.298907 -2.196864 1.552482
H  -4.406067 -1.760158 -0.144956
H  -3.120283 -0.579267 3.15857
H  -4.009295 0.479588 -0.890659
H  -2.685559 1.786614 3.681766
H  -3.586558 2.849301 -0.366006
H  -2.911707 3.514131 1.922546
elementType: O C H
totalener: -1079.73696759 hartree
nucrepener: 2194.70615561 hartree
electener: -3274.44312320 hartree
oneelecener: -5828.73142625 hartree
twoeener: 2554.28830306 hartree
cpcmener: -0.03077477 hartree
kineticenergy: 1074.85784161 hartree
xcener: -106.461992655468 hartree
chargesum: 0.0000000
charge: -0.278848 -0.499758 -0.281495 0.176029 0.016216 -0.132886 -0.284527 -0.366336 -0.278919 0.421940 -0.035652 -0.230926 -0.251256 0.074185 -0.049144 -0.402918 -0.023249 0.244684 -0.042387 0.019286 -0.195794 -0.162838 -0.159332 -0.182547 -0.163184 0.106800 0.097736 0.101740 0.097254 0.094367 0.105100 0.108900 0.105791 0.120833 0.094844 0.089772 0.095395 0.086905 0.097687 0.103910 0.120448 0.120369 0.165802 0.176343 0.110552 0.109121 0.141539 0.140177 0.159129 0.159122 0.160022
qa: -0.2788 -0.4998 -0.2815 0.1760 0.0162 -0.1329 -0.2845 -0.3663 -0.2789 0.4219 -0.0357 -0.2309 -0.2513 0.0742 -0.0491 -0.4029 -0.0232 0.2447 -0.0424 0.0193 -0.1958 -0.1628 -0.1593 -0.1825 -0.1632 0.1068 0.0977 0.1017 0.0973 0.0944 0.1051 0.1089 0.1058 0.1208 0.0948 0.0898 0.0954 0.0869 0.0977 0.1039 0.1204 0.1204 0.1658 0.1763 0.1106 0.1091 0.1415 0.1402 0.1591 0.1591 0.1600
va: 2.1159 1.9920 2.2669 3.6614 3.7787 3.8760 3.8998 3.9115 3.8446 4.1853 3.7098 3.9277 3.9355 3.8335 3.6200 3.9594 3.9615 3.5591 3.8107 3.6165 3.9204 3.8659 3.8887 3.8653 3.8570 1.0182 1.0313 1.0027 1.0000 1.0029 0.9984 0.9937 1.0058 1.0076 0.9962 1.0071 0.9952 1.0079 0.9978 0.9992 1.0096 0.9954 1.0070 1.0010 1.0149 1.0101 1.0094 1.0035 0.9903 0.9911 0.9898
dispcorr: -0.027694998 hartree
energy: -1079.764662583264
dipole: 9.94996 -10.82652 -0.87656 24.70473 -23.62709 1.07764 -9.31694 8.03225 -1.28470
magnitude: 1.89212 au
magnitude: 4.80938 debye
